isic_id,attribution,copyright_license,age_approx,anatom_site_general,benign_malignant,clin_size_long_diam_mm,concomitant_biopsy,diagnosis,diagnosis_confirm_type,image_type,lesion_id,mel_class,mel_mitotic_index,mel_thick_mm,mel_ulcer,melanocytic,nevus_type,patient_id,sex
ISIC_0125986,Sydney Melanoma Diagnostic Center at Royal Prince Alfred Hospital,CC-BY,40,lower extremity,benign,1.90,True,nevus,histopathology,dermoscopic,IL_1461720,,,,,True,,IP_8132759,female
ISIC_0214484,Sydney Melanoma Diagnostic Center at Royal Prince Alfred Hospital,CC-BY,45,lower extremity,malignant,4.90,True,melanoma,histopathology,dermoscopic,IL_1952601,invasive melanoma,,1.00,,True,,IP_3291986,male
ISIC_0220705,Sydney Melanoma Diagnostic Center at Royal Prince Alfred Hospital,CC-BY,45,upper extremity,benign,3.80,True,nevus,histopathology,dermoscopic,IL_8247863,,,,,True,,IP_0885936,female
ISIC_0274411,Sydney Melanoma Diagnostic Center at Royal Prince Alfred Hospital,CC-BY,60,posterior torso,malignant,10.70,True,melanoma,histopathology,dermoscopic,IL_1669417,melanoma in situ,,,,True,,IP_0284553,male
ISIC_0310603,Sydney Melanoma Diagnostic Center at Royal Prince Alfred Hospital,CC-BY,55,posterior torso,malignant,8.00,True,melanoma,histopathology,dermoscopic,IL_7060875,melanoma in situ,,,,True,,IP_4154448,male
ISIC_0424077,Sydney Melanoma Diagnostic Center at Royal Prince Alfred Hospital,CC-BY,85,lateral torso,benign,5.80,True,nevus,histopathology,dermoscopic,IL_5558883,,,,,True,,IP_5651672,male
ISIC_0467368,Sydney Melanoma Diagnostic Center at Royal Prince Alfred Hospital,CC-BY,80,upper extremity,benign,5.10,True,nevus,histopathology,dermoscopic,IL_8462292,,,,,True,,IP_9348131,male
ISIC_0515784,Sydney Melanoma Diagnostic Center at Royal Prince Alfred Hospital,CC-BY,65,upper extremity,benign,5.20,True,nevus,histopathology,dermoscopic,IL_8179865,,,,,True,,IP_2095204,female
ISIC_0524746,Sydney Melanoma Diagnostic Center at Royal Prince Alfred Hospital,CC-BY,40,lateral torso,benign,2.40,True,nevus,histopathology,dermoscopic,IL_3064740,,,,,True,,IP_4413274,female
ISIC_0541318,Sydney Melanoma Diagnostic Center at Royal Prince Alfred Hospital,CC-BY,55,lower extremity,benign,10.10,True,nevus,histopathology,dermoscopic,IL_7366482,,,,,True,,IP_6119246,male
ISIC_0550002,Sydney Melanoma Diagnostic Center at Royal Prince Alfred Hospital,CC-BY,85,lower extremity,malignant,13.70,True,melanoma,histopathology,dermoscopic,IL_1282505,melanoma in situ,,,,True,,IP_5630006,male
ISIC_0573528,Sydney Melanoma Diagnostic Center at Royal Prince Alfred Hospital,CC-BY,40,posterior torso,benign,5.80,True,nevus,histopathology,dermoscopic,IL_2447709,,,,,True,,IP_7496321,female
ISIC_0587728,Sydney Melanoma Diagnostic Center at Royal Prince Alfred Hospital,CC-BY,65,lower extremity,malignant,4.40,True,melanoma,histopathology,dermoscopic,IL_2719530,melanoma in situ,,,,True,,IP_0281943,male
ISIC_0616448,Sydney Melanoma Diagnostic Center at Royal Prince Alfred Hospital,CC-BY,45,upper extremity,malignant,5.80,True,melanoma,histopathology,dermoscopic,IL_5207360,melanoma in situ,,,,True,,IP_0528210,male
ISIC_0781856,Sydney Melanoma Diagnostic Center at Royal Prince Alfred Hospital,CC-BY,40,upper extremity,benign,4.30,True,nevus,histopathology,dermoscopic,IL_5523133,,,,,True,,IP_6387342,female
ISIC_0802880,Sydney Melanoma Diagnostic Center at Royal Prince Alfred Hospital,CC-BY,55,posterior torso,malignant,7.00,True,melanoma,histopathology,dermoscopic,IL_2825189,melanoma in situ,,,,True,,IP_4154448,male
ISIC_0874555,Sydney Melanoma Diagnostic Center at Royal Prince Alfred Hospital,CC-BY,60,anterior torso,benign,4.40,True,nevus,histopathology,dermoscopic,IL_8104165,,,,,True,,IP_3379522,female
ISIC_0914259,Sydney Melanoma Diagnostic Center at Royal Prince Alfred Hospital,CC-BY,30,lower extremity,benign,1.40,True,nevus,histopathology,dermoscopic,IL_8933105,,,,,True,,IP_7452699,female
ISIC_0920647,Sydney Melanoma Diagnostic Center at Royal Prince Alfred Hospital,CC-BY,55,lower extremity,benign,2.50,True,nevus,histopathology,dermoscopic,IL_2304485,,,,,True,,IP_9016111,female
ISIC_0961778,Sydney Melanoma Diagnostic Center at Royal Prince Alfred Hospital,CC-BY,75,upper extremity,malignant,5.20,True,melanoma,histopathology,dermoscopic,IL_2448449,melanoma in situ,,,,True,,IP_4523797,female
ISIC_1049431,Sydney Melanoma Diagnostic Center at Royal Prince Alfred Hospital,CC-BY,35,posterior torso,benign,5.00,True,nevus,histopathology,dermoscopic,IL_5378175,,,,,True,,IP_2067014,female
ISIC_1061502,Sydney Melanoma Diagnostic Center at Royal Prince Alfred Hospital,CC-BY,50,posterior torso,benign,8.30,True,nevus,histopathology,dermoscopic,IL_9919489,,,,,True,,IP_0083448,male
ISIC_1117631,Sydney Melanoma Diagnostic Center at Royal Prince Alfred Hospital,CC-BY,50,lower extremity,benign,2.10,True,nevus,histopathology,dermoscopic,IL_9351202,,,,,True,,IP_0865059,female
ISIC_1126871,Sydney Melanoma Diagnostic Center at Royal Prince Alfred Hospital,CC-BY,65,lower extremity,benign,0.80,True,nevus,histopathology,dermoscopic,IL_7185978,,,,,True,,IP_7712665,female
ISIC_1151359,Sydney Melanoma Diagnostic Center at Royal Prince Alfred Hospital,CC-BY,35,posterior torso,benign,5.20,True,nevus,histopathology,dermoscopic,IL_1502910,,,,,True,,IP_7204491,female
ISIC_1203272,Sydney Melanoma Diagnostic Center at Royal Prince Alfred Hospital,CC-BY,75,posterior torso,malignant,8.70,True,melanoma,histopathology,dermoscopic,IL_8284178,invasive melanoma,,0.60,,True,,IP_7286860,female
ISIC_1317150,Sydney Melanoma Diagnostic Center at Royal Prince Alfred Hospital,CC-BY,80,posterior torso,benign,6.00,True,nevus,histopathology,dermoscopic,IL_7590638,,,,,True,,IP_0954322,male
ISIC_1353101,Sydney Melanoma Diagnostic Center at Royal Prince Alfred Hospital,CC-BY,60,head/neck,malignant,6.50,True,melanoma,histopathology,dermoscopic,IL_1927949,melanoma in situ,,,,True,,IP_6683521,male
ISIC_1436751,Sydney Melanoma Diagnostic Center at Royal Prince Alfred Hospital,CC-BY,35,lower extremity,benign,2.70,True,nevus,histopathology,dermoscopic,IL_9307489,,,,,True,,IP_5034423,male
ISIC_1539931,Sydney Melanoma Diagnostic Center at Royal Prince Alfred Hospital,CC-BY,60,anterior torso,benign,10.90,True,nevus,histopathology,dermoscopic,IL_1959963,,,,,True,,IP_7243101,female
ISIC_1636416,Sydney Melanoma Diagnostic Center at Royal Prince Alfred Hospital,CC-BY,30,lower extremity,benign,2.40,True,nevus,histopathology,dermoscopic,IL_3113470,,,,,True,,IP_0435040,female
ISIC_1724126,Sydney Melanoma Diagnostic Center at Royal Prince Alfred Hospital,CC-BY,55,posterior torso,benign,1.50,True,nevus,histopathology,dermoscopic,IL_0228347,,,,,True,,IP_9018954,male
ISIC_1871611,Sydney Melanoma Diagnostic Center at Royal Prince Alfred Hospital,CC-BY,55,anterior torso,benign,6.50,True,nevus,histopathology,dermoscopic,IL_6755724,,,,,True,,IP_5741248,female
ISIC_1871813,Sydney Melanoma Diagnostic Center at Royal Prince Alfred Hospital,CC-BY,50,lower extremity,benign,2.40,True,nevus,histopathology,dermoscopic,IL_2200390,,,,,True,,IP_2321294,female
ISIC_1873909,Sydney Melanoma Diagnostic Center at Royal Prince Alfred Hospital,CC-BY,50,lower extremity,benign,0.80,True,nevus,histopathology,dermoscopic,IL_9443249,,,,,True,,IP_3727647,female
ISIC_1931730,Sydney Melanoma Diagnostic Center at Royal Prince Alfred Hospital,CC-BY,45,lower extremity,malignant,5.80,True,melanoma,histopathology,dermoscopic,IL_5916191,melanoma in situ,,,,True,,IP_9103082,female
ISIC_2190396,Sydney Melanoma Diagnostic Center at Royal Prince Alfred Hospital,CC-BY,35,posterior torso,malignant,2.80,True,melanoma,histopathology,dermoscopic,IL_9326149,melanoma in situ,,,,True,,IP_6334660,male
ISIC_2291941,Sydney Melanoma Diagnostic Center at Royal Prince Alfred Hospital,CC-BY,35,posterior torso,benign,3.20,True,nevus,histopathology,dermoscopic,IL_2169011,,,,,True,,IP_3999111,female
ISIC_2375479,Sydney Melanoma Diagnostic Center at Royal Prince Alfred Hospital,CC-BY,50,lower extremity,benign,2.70,True,nevus,histopathology,dermoscopic,IL_4179838,,,,,True,,IP_3727647,female
ISIC_2392633,Sydney Melanoma Diagnostic Center at Royal Prince Alfred Hospital,CC-BY,55,upper extremity,malignant,2.00,True,melanoma,histopathology,dermoscopic,IL_2045790,melanoma in situ,,,,True,,IP_3344965,female
ISIC_2411322,Sydney Melanoma Diagnostic Center at Royal Prince Alfred Hospital,CC-BY,60,posterior torso,benign,1.90,True,nevus,histopathology,dermoscopic,IL_0430754,,,,,True,,IP_1846738,female
ISIC_2468476,Sydney Melanoma Diagnostic Center at Royal Prince Alfred Hospital,CC-BY,50,lower extremity,malignant,3.20,True,melanoma,histopathology,dermoscopic,IL_1235162,melanoma in situ,,,,True,,IP_5078204,male
ISIC_2492497,Sydney Melanoma Diagnostic Center at Royal Prince Alfred Hospital,CC-BY,70,upper extremity,benign,2.00,True,nevus,histopathology,dermoscopic,IL_6838936,,,,,True,,IP_8046304,male
ISIC_2582340,Sydney Melanoma Diagnostic Center at Royal Prince Alfred Hospital,CC-BY,55,anterior torso,benign,3.90,True,nevus,histopathology,dermoscopic,IL_7162791,,,,,True,,IP_5741248,female
ISIC_2593104,Sydney Melanoma Diagnostic Center at Royal Prince Alfred Hospital,CC-BY,50,lower extremity,malignant,3.30,True,melanoma,histopathology,dermoscopic,IL_6019423,melanoma in situ,,,,True,,IP_8910504,male
ISIC_2593673,Sydney Melanoma Diagnostic Center at Royal Prince Alfred Hospital,CC-BY,40,upper extremity,benign,3.80,True,nevus,histopathology,dermoscopic,IL_1409962,,,,,True,,IP_7186053,female
ISIC_2600516,Sydney Melanoma Diagnostic Center at Royal Prince Alfred Hospital,CC-BY,50,upper extremity,benign,4.30,True,nevus,histopathology,dermoscopic,IL_8204057,,,,,True,,IP_1213877,male
ISIC_2710921,Sydney Melanoma Diagnostic Center at Royal Prince Alfred Hospital,CC-BY,45,posterior torso,benign,3.10,True,nevus,histopathology,dermoscopic,IL_0864101,,,,,True,,IP_3291986,male
ISIC_2772824,Sydney Melanoma Diagnostic Center at Royal Prince Alfred Hospital,CC-BY,50,head/neck,malignant,4.90,True,melanoma,histopathology,dermoscopic,IL_5087915,melanoma in situ,,,,True,,IP_3757165,male
ISIC_2837034,Sydney Melanoma Diagnostic Center at Royal Prince Alfred Hospital,CC-BY,70,lower extremity,malignant,13.90,True,melanoma,histopathology,dermoscopic,IL_7054835,invasive melanoma,,0.80,,True,,IP_1651414,female
ISIC_2840397,Sydney Melanoma Diagnostic Center at Royal Prince Alfred Hospital,CC-BY,50,upper extremity,benign,5.10,True,nevus,histopathology,dermoscopic,IL_7253189,,,,,True,,IP_1085340,female
ISIC_2842822,Sydney Melanoma Diagnostic Center at Royal Prince Alfred Hospital,CC-BY,50,lower extremity,benign,2.50,True,nevus,histopathology,dermoscopic,IL_9607129,,,,,True,,IP_5900251,male
ISIC_2850515,Sydney Melanoma Diagnostic Center at Royal Prince Alfred Hospital,CC-BY,30,head/neck,benign,3.90,True,nevus,histopathology,dermoscopic,IL_2076080,,,,,True,,IP_4567124,female
ISIC_3041861,Sydney Melanoma Diagnostic Center at Royal Prince Alfred Hospital,CC-BY,85,anterior torso,malignant,9.20,True,melanoma,histopathology,dermoscopic,IL_0006755,melanoma in situ,,,,True,,IP_6700171,female
ISIC_3087803,Sydney Melanoma Diagnostic Center at Royal Prince Alfred Hospital,CC-BY,50,upper extremity,benign,2.10,True,nevus,histopathology,dermoscopic,IL_1154443,,,,,True,combined,IP_0569337,male
ISIC_3138977,Sydney Melanoma Diagnostic Center at Royal Prince Alfred Hospital,CC-BY,50,lateral torso,benign,4.50,True,nevus,histopathology,dermoscopic,IL_4170874,,,,,True,,IP_3103178,male
ISIC_3238119,Sydney Melanoma Diagnostic Center at Royal Prince Alfred Hospital,CC-BY,40,upper extremity,benign,3.90,True,nevus,histopathology,dermoscopic,IL_4201282,,,,,True,,IP_1398125,male
ISIC_3275875,Sydney Melanoma Diagnostic Center at Royal Prince Alfred Hospital,CC-BY,65,posterior torso,malignant,5.80,True,melanoma,histopathology,dermoscopic,IL_4212949,melanoma in situ,,,,True,,IP_2084560,male
ISIC_3297094,Sydney Melanoma Diagnostic Center at Royal Prince Alfred Hospital,CC-BY,55,posterior torso,malignant,14.40,True,melanoma,histopathology,dermoscopic,IL_0878202,melanoma in situ,,,,True,,IP_0354751,female
ISIC_3405752,Sydney Melanoma Diagnostic Center at Royal Prince Alfred Hospital,CC-BY,30,upper extremity,benign,1.00,True,nevus,histopathology,dermoscopic,IL_9599863,,,,,True,,IP_2625869,male
ISIC_3405916,Sydney Melanoma Diagnostic Center at Royal Prince Alfred Hospital,CC-BY,70,upper extremity,benign,3.90,True,nevus,histopathology,dermoscopic,IL_5961437,,,,,True,,IP_6087703,male
ISIC_3597439,Sydney Melanoma Diagnostic Center at Royal Prince Alfred Hospital,CC-BY,45,lower extremity,benign,1.90,True,nevus,histopathology,dermoscopic,IL_5203043,,,,,True,,IP_5622181,male
ISIC_3622555,Sydney Melanoma Diagnostic Center at Royal Prince Alfred Hospital,CC-BY,50,lower extremity,malignant,7.50,True,melanoma,histopathology,dermoscopic,IL_5368862,melanoma in situ,,,,True,,IP_5709181,female
ISIC_3685603,Sydney Melanoma Diagnostic Center at Royal Prince Alfred Hospital,CC-BY,45,posterior torso,benign,2.50,True,nevus,histopathology,dermoscopic,IL_1049510,,,,,True,,IP_7295964,female
ISIC_3689252,Sydney Melanoma Diagnostic Center at Royal Prince Alfred Hospital,CC-BY,40,lower extremity,malignant,2.00,True,melanoma,histopathology,dermoscopic,IL_0007801,melanoma in situ,,,,True,,IP_0012997,female
ISIC_3716952,Sydney Melanoma Diagnostic Center at Royal Prince Alfred Hospital,CC-BY,45,upper extremity,benign,4.20,True,nevus,histopathology,dermoscopic,IL_2372134,,,,,True,,IP_2029060,male
ISIC_3736336,Sydney Melanoma Diagnostic Center at Royal Prince Alfred Hospital,CC-BY,60,posterior torso,malignant,7.80,True,melanoma,histopathology,dermoscopic,IL_6235184,melanoma in situ,,,,True,,IP_8181377,male
ISIC_3783659,Sydney Melanoma Diagnostic Center at Royal Prince Alfred Hospital,CC-BY,65,posterior torso,malignant,8.80,True,melanoma,histopathology,dermoscopic,IL_0309038,melanoma in situ,,,,True,,IP_2273278,male
ISIC_3821765,Sydney Melanoma Diagnostic Center at Royal Prince Alfred Hospital,CC-BY,55,lower extremity,benign,2.80,True,nevus,histopathology,dermoscopic,IL_0950738,,,,,True,,IP_9826278,female
ISIC_3850091,Sydney Melanoma Diagnostic Center at Royal Prince Alfred Hospital,CC-BY,60,anterior torso,benign,2.70,True,nevus,histopathology,dermoscopic,IL_7559922,,,,,True,,IP_0207680,female
ISIC_3872441,Sydney Melanoma Diagnostic Center at Royal Prince Alfred Hospital,CC-BY,45,lower extremity,malignant,1.50,True,melanoma,histopathology,dermoscopic,IL_5443460,invasive melanoma,0/mm^2,0.30,False,True,,IP_4714140,female
ISIC_3957649,Sydney Melanoma Diagnostic Center at Royal Prince Alfred Hospital,CC-BY,45,lower extremity,benign,2.50,True,nevus,histopathology,dermoscopic,IL_4696811,,,,,True,,IP_5573847,female
ISIC_4027194,Sydney Melanoma Diagnostic Center at Royal Prince Alfred Hospital,CC-BY,35,lower extremity,malignant,1.80,True,melanoma,histopathology,dermoscopic,IL_0687348,melanoma in situ,,,,True,,IP_6770558,female
ISIC_4030656,Sydney Melanoma Diagnostic Center at Royal Prince Alfred Hospital,CC-BY,35,posterior torso,benign,3.00,True,nevus,histopathology,dermoscopic,IL_2098876,,,,,True,,IP_3830672,male
ISIC_4065018,Sydney Melanoma Diagnostic Center at Royal Prince Alfred Hospital,CC-BY,55,lower extremity,benign,3.60,True,nevus,histopathology,dermoscopic,IL_8784707,,,,,True,,IP_7741719,male
ISIC_4127882,Sydney Melanoma Diagnostic Center at Royal Prince Alfred Hospital,CC-BY,45,posterior torso,benign,5.60,True,nevus,histopathology,dermoscopic,IL_7007160,,,,,True,,IP_3878998,male
ISIC_4151771,Sydney Melanoma Diagnostic Center at Royal Prince Alfred Hospital,CC-BY,50,upper extremity,benign,3.90,True,nevus,histopathology,dermoscopic,IL_3604807,,,,,True,,IP_1877958,female
ISIC_4221304,Sydney Melanoma Diagnostic Center at Royal Prince Alfred Hospital,CC-BY,30,lower extremity,malignant,1.70,True,melanoma,histopathology,dermoscopic,IL_2261784,melanoma in situ,,,,True,,IP_5704453,female
ISIC_4292976,Sydney Melanoma Diagnostic Center at Royal Prince Alfred Hospital,CC-BY,35,posterior torso,benign,1.50,True,nevus,histopathology,dermoscopic,IL_3568928,,,,,True,,IP_1494754,female
ISIC_4334691,Sydney Melanoma Diagnostic Center at Royal Prince Alfred Hospital,CC-BY,35,posterior torso,benign,2.90,True,nevus,histopathology,dermoscopic,IL_0882048,,,,,True,,IP_2931815,female
ISIC_4424751,Sydney Melanoma Diagnostic Center at Royal Prince Alfred Hospital,CC-BY,55,anterior torso,benign,2.90,True,nevus,histopathology,dermoscopic,IL_0712175,,,,,True,,IP_6740951,female
ISIC_4547332,Sydney Melanoma Diagnostic Center at Royal Prince Alfred Hospital,CC-BY,25,posterior torso,malignant,2.90,True,melanoma,histopathology,dermoscopic,IL_0454630,melanoma in situ,,,,True,,IP_0549014,female
ISIC_4561067,Sydney Melanoma Diagnostic Center at Royal Prince Alfred Hospital,CC-BY,70,upper extremity,malignant,12.20,True,melanoma,histopathology,dermoscopic,IL_6216001,melanoma in situ,,,,True,,IP_5253646,male
ISIC_4709088,Sydney Melanoma Diagnostic Center at Royal Prince Alfred Hospital,CC-BY,55,anterior torso,benign,6.80,True,nevus,histopathology,dermoscopic,IL_7444076,,,,,True,,IP_0038454,male
ISIC_4718954,Sydney Melanoma Diagnostic Center at Royal Prince Alfred Hospital,CC-BY,50,upper extremity,malignant,16.90,True,melanoma,histopathology,dermoscopic,IL_9750267,melanoma in situ,,,,True,,IP_9904101,male
ISIC_4728712,Sydney Melanoma Diagnostic Center at Royal Prince Alfred Hospital,CC-BY,65,posterior torso,benign,2.30,True,nevus,histopathology,dermoscopic,IL_4195113,,,,,True,,IP_1048784,female
ISIC_4769627,Sydney Melanoma Diagnostic Center at Royal Prince Alfred Hospital,CC-BY,40,posterior torso,benign,2.70,True,nevus,histopathology,dermoscopic,IL_9290430,,,,,True,,IP_4841347,male
ISIC_4858225,Sydney Melanoma Diagnostic Center at Royal Prince Alfred Hospital,CC-BY,65,head/neck,benign,5.30,True,nevus,histopathology,dermoscopic,IL_7174446,,,,,True,,IP_3463579,female
ISIC_4883295,Sydney Melanoma Diagnostic Center at Royal Prince Alfred Hospital,CC-BY,40,lower extremity,benign,5.70,True,nevus,histopathology,dermoscopic,IL_5383957,,,,,True,,IP_5169973,female
ISIC_5070333,Sydney Melanoma Diagnostic Center at Royal Prince Alfred Hospital,CC-BY,40,lower extremity,benign,1.70,True,nevus,histopathology,dermoscopic,IL_7738951,,,,,True,,IP_7183783,male
ISIC_5095180,Sydney Melanoma Diagnostic Center at Royal Prince Alfred Hospital,CC-BY,30,lower extremity,malignant,3.80,True,melanoma,histopathology,dermoscopic,IL_2905432,melanoma in situ,,,,True,,IP_4154563,female
ISIC_5112138,Sydney Melanoma Diagnostic Center at Royal Prince Alfred Hospital,CC-BY,70,lower extremity,benign,5.00,True,nevus,histopathology,dermoscopic,IL_0093544,,,,,True,,IP_9528635,male
ISIC_5306850,Sydney Melanoma Diagnostic Center at Royal Prince Alfred Hospital,CC-BY,70,lateral torso,malignant,7.40,True,melanoma,histopathology,dermoscopic,IL_1516857,melanoma in situ,,,,True,,IP_2305253,male
ISIC_5412404,Sydney Melanoma Diagnostic Center at Royal Prince Alfred Hospital,CC-BY,35,posterior torso,benign,1.60,True,nevus,histopathology,dermoscopic,IL_4728389,,,,,True,,IP_4150295,female
ISIC_5426103,Sydney Melanoma Diagnostic Center at Royal Prince Alfred Hospital,CC-BY,45,anterior torso,benign,5.30,True,nevus,histopathology,dermoscopic,IL_1305164,,,,,True,,IP_2319816,male
ISIC_5523572,Sydney Melanoma Diagnostic Center at Royal Prince Alfred Hospital,CC-BY,85,anterior torso,malignant,4.90,True,melanoma,histopathology,dermoscopic,IL_7876906,invasive melanoma,,0.40,,True,,IP_5651672,male
ISIC_5540569,Sydney Melanoma Diagnostic Center at Royal Prince Alfred Hospital,CC-BY,50,anterior torso,benign,2.60,True,nevus,histopathology,dermoscopic,IL_0117600,,,,,True,,IP_1874903,male
ISIC_5561187,Sydney Melanoma Diagnostic Center at Royal Prince Alfred Hospital,CC-BY,45,lower extremity,malignant,2.20,True,melanoma,histopathology,dermoscopic,IL_3808292,melanoma in situ,,,,True,,IP_8500979,male
ISIC_5588785,Sydney Melanoma Diagnostic Center at Royal Prince Alfred Hospital,CC-BY,40,anterior torso,benign,4.80,True,nevus,histopathology,dermoscopic,IL_8988389,,,,,True,,IP_0409451,male
ISIC_5704299,Sydney Melanoma Diagnostic Center at Royal Prince Alfred Hospital,CC-BY,65,head/neck,benign,5.80,True,nevus,histopathology,dermoscopic,IL_3708705,,,,,True,,IP_2107369,male
ISIC_5711232,Sydney Melanoma Diagnostic Center at Royal Prince Alfred Hospital,CC-BY,60,anterior torso,malignant,10.10,True,melanoma,histopathology,dermoscopic,IL_4694863,melanoma in situ,,,,True,,IP_6569379,female
ISIC_5851414,Sydney Melanoma Diagnostic Center at Royal Prince Alfred Hospital,CC-BY,55,posterior torso,benign,2.20,True,nevus,histopathology,dermoscopic,IL_4371907,,,,,True,,IP_0038454,male
ISIC_5857669,Sydney Melanoma Diagnostic Center at Royal Prince Alfred Hospital,CC-BY,60,posterior torso,benign,6.80,True,nevus,histopathology,dermoscopic,IL_4971385,,,,,True,,IP_8504517,male
ISIC_5941322,Sydney Melanoma Diagnostic Center at Royal Prince Alfred Hospital,CC-BY,70,upper extremity,malignant,3.30,True,melanoma,histopathology,dermoscopic,IL_4732104,melanoma in situ,,,,True,,IP_5253646,male
ISIC_6016537,Sydney Melanoma Diagnostic Center at Royal Prince Alfred Hospital,CC-BY,75,head/neck,malignant,3.60,True,melanoma,histopathology,dermoscopic,IL_5045525,melanoma in situ,,,,True,,IP_0549683,male
ISIC_6043221,Sydney Melanoma Diagnostic Center at Royal Prince Alfred Hospital,CC-BY,70,head/neck,benign,3.10,True,nevus,histopathology,dermoscopic,IL_6238097,,,,,True,,IP_0076650,male
ISIC_6086907,Sydney Melanoma Diagnostic Center at Royal Prince Alfred Hospital,CC-BY,50,upper extremity,benign,9.00,True,nevus,histopathology,dermoscopic,IL_9907629,,,,,True,,IP_3103178,male
ISIC_6099785,Sydney Melanoma Diagnostic Center at Royal Prince Alfred Hospital,CC-BY,45,posterior torso,malignant,2.30,True,melanoma,histopathology,dermoscopic,IL_7845233,melanoma in situ,,,,True,,IP_8384762,female
ISIC_6268236,Sydney Melanoma Diagnostic Center at Royal Prince Alfred Hospital,CC-BY,40,posterior torso,malignant,1.70,True,melanoma,histopathology,dermoscopic,IL_9778197,melanoma in situ,,,,True,,IP_5491923,female
ISIC_6275817,Sydney Melanoma Diagnostic Center at Royal Prince Alfred Hospital,CC-BY,40,anterior torso,malignant,4.10,True,melanoma,histopathology,dermoscopic,IL_1829358,melanoma in situ,,,,True,,IP_5327237,male
ISIC_6334193,Sydney Melanoma Diagnostic Center at Royal Prince Alfred Hospital,CC-BY,70,posterior torso,benign,6.40,True,nevus,histopathology,dermoscopic,IL_2657670,,,,,True,,IP_2189129,male
ISIC_6345126,Sydney Melanoma Diagnostic Center at Royal Prince Alfred Hospital,CC-BY,50,anterior torso,benign,5.00,True,nevus,histopathology,dermoscopic,IL_6687408,,,,,True,,IP_1085340,female
ISIC_6356718,Sydney Melanoma Diagnostic Center at Royal Prince Alfred Hospital,CC-BY,50,posterior torso,benign,2.80,True,nevus,histopathology,dermoscopic,IL_6878135,,,,,True,,IP_8528048,male
ISIC_6577436,Sydney Melanoma Diagnostic Center at Royal Prince Alfred Hospital,CC-BY,70,lower extremity,malignant,6.70,True,melanoma,histopathology,dermoscopic,IL_4779303,melanoma in situ,,,,True,,IP_9862144,male
ISIC_6577694,Sydney Melanoma Diagnostic Center at Royal Prince Alfred Hospital,CC-BY,55,lower extremity,benign,1.30,True,nevus,histopathology,dermoscopic,IL_1206698,,,,,True,,IP_1394449,female
ISIC_6578433,Sydney Melanoma Diagnostic Center at Royal Prince Alfred Hospital,CC-BY,60,posterior torso,malignant,5.40,True,melanoma,histopathology,dermoscopic,IL_7800344,melanoma in situ,,,,True,,IP_6683521,male
ISIC_6586433,Sydney Melanoma Diagnostic Center at Royal Prince Alfred Hospital,CC-BY,50,posterior torso,malignant,5.50,True,melanoma,histopathology,dermoscopic,IL_8654461,melanoma in situ,,,,True,,IP_0083448,male
ISIC_6618014,Sydney Melanoma Diagnostic Center at Royal Prince Alfred Hospital,CC-BY,25,lower extremity,malignant,2.00,True,melanoma,histopathology,dermoscopic,IL_6948222,melanoma in situ,,,,True,,IP_1295012,female