isic_id,attribution,copyright_license,age_approx,anatom_site_general,benign_malignant,clin_size_long_diam_mm,concomitant_biopsy,diagnosis,diagnosis_confirm_type,image_type,mel_class,mel_mitotic_index,mel_thick_mm,mel_type,mel_ulcer,melanocytic,sex
ISIC_0051799,Memorial Sloan Kettering Cancer Center,CC-BY,45,lower extremity,benign,4.80,True,nevus,histopathology,dermoscopic,,,,,,True,female
ISIC_0081584,Memorial Sloan Kettering Cancer Center,CC-BY,55,posterior torso,benign,3.30,True,nevus,histopathology,dermoscopic,,,,,,True,male
ISIC_0082704,Memorial Sloan Kettering Cancer Center,CC-BY,35,anterior torso,benign,7.30,True,nevus,histopathology,dermoscopic,,,,,,True,female
ISIC_0084117,Memorial Sloan Kettering Cancer Center,CC-BY,20,anterior torso,benign,4.30,True,nevus,histopathology,dermoscopic,,,,,,True,female
ISIC_0101540,Memorial Sloan Kettering Cancer Center,CC-BY,35,lateral torso,benign,7.10,True,nevus,histopathology,dermoscopic,,,,,,True,female
ISIC_0103730,Memorial Sloan Kettering Cancer Center,CC-BY,65,lower extremity,benign,4.10,True,nevus,histopathology,dermoscopic,,,,,,True,female
ISIC_0104911,Memorial Sloan Kettering Cancer Center,CC-BY,60,upper extremity,benign,9.30,True,nevus,histopathology,dermoscopic,,,,,,True,male
ISIC_0112457,Memorial Sloan Kettering Cancer Center,CC-BY,50,posterior torso,benign,4.50,True,nevus,histopathology,dermoscopic,,,,,,True,female
ISIC_0118792,Memorial Sloan Kettering Cancer Center,CC-BY,55,posterior torso,benign,5.00,True,nevus,histopathology,dermoscopic,,,,,,True,female
ISIC_0119296,Memorial Sloan Kettering Cancer Center,CC-BY,80,anterior torso,benign,15.80,True,solar lentigo,histopathology,dermoscopic,,,,,,True,female
ISIC_0126191,Memorial Sloan Kettering Cancer Center,CC-BY,75,upper extremity,benign,6.80,True,solar lentigo,histopathology,dermoscopic,,,,,,True,female
ISIC_0135990,Memorial Sloan Kettering Cancer Center,CC-BY,65,lower extremity,benign,2.90,True,solar lentigo,histopathology,dermoscopic,,,,,,True,male
ISIC_0136396,Memorial Sloan Kettering Cancer Center,CC-BY,50,head/neck,benign,7.40,True,nevus,histopathology,dermoscopic,,,,,,True,female
ISIC_0140720,Memorial Sloan Kettering Cancer Center,CC-BY,75,upper extremity,benign,6.40,True,solar lentigo,histopathology,dermoscopic,,,,,,True,female
ISIC_0148118,Memorial Sloan Kettering Cancer Center,CC-BY,65,anterior torso,benign,4.70,True,verruca,histopathology,dermoscopic,,,,,,False,female
ISIC_0178317,Memorial Sloan Kettering Cancer Center,CC-BY,35,posterior torso,benign,5.20,True,nevus,histopathology,dermoscopic,,,,,,True,female
ISIC_0186998,Memorial Sloan Kettering Cancer Center,CC-BY,50,upper extremity,malignant,3.10,True,melanoma,histopathology,dermoscopic,melanoma in situ,,,,,True,female
ISIC_0188232,Memorial Sloan Kettering Cancer Center,CC-BY,70,anterior torso,benign,3.90,True,nevus,histopathology,dermoscopic,,,,,,True,male
ISIC_0191276,Memorial Sloan Kettering Cancer Center,CC-BY,60,posterior torso,benign,7.30,True,lichenoid keratosis,histopathology,dermoscopic,,,,,,False,male
ISIC_0198315,Memorial Sloan Kettering Cancer Center,CC-BY,55,anterior torso,benign,4.50,True,nevus,histopathology,dermoscopic,,,,,,True,female
ISIC_0205337,Memorial Sloan Kettering Cancer Center,CC-BY,25,anterior torso,indeterminate,7.70,True,atypical melanocytic proliferation,histopathology,dermoscopic,,,,,,True,female
ISIC_0218137,Memorial Sloan Kettering Cancer Center,CC-BY,85,lateral torso,benign,3.60,True,nevus,histopathology,dermoscopic,,,,,,True,female
ISIC_0222050,Memorial Sloan Kettering Cancer Center,CC-BY,75,lower extremity,benign,5.40,True,nevus,histopathology,dermoscopic,,,,,,True,male
ISIC_0223461,Memorial Sloan Kettering Cancer Center,CC-BY,80,upper extremity,benign,5.30,True,solar lentigo,histopathology,dermoscopic,,,,,,True,female
ISIC_0224332,Memorial Sloan Kettering Cancer Center,CC-BY,55,lower extremity,benign,8.30,True,nevus,histopathology,dermoscopic,,,,,,True,female
ISIC_0235971,Memorial Sloan Kettering Cancer Center,CC-BY,65,upper extremity,benign,4.10,True,atypical melanocytic proliferation,histopathology,dermoscopic,,,,,,True,female
ISIC_0245720,Memorial Sloan Kettering Cancer Center,CC-BY,60,upper extremity,malignant,11.30,True,melanoma,histopathology,dermoscopic,melanoma in situ,,,lentigo maligna melanoma,,True,male
ISIC_0249688,Memorial Sloan Kettering Cancer Center,CC-BY,45,posterior torso,benign,8.70,True,nevus,histopathology,dermoscopic,,,,,,True,female
ISIC_0259780,Memorial Sloan Kettering Cancer Center,CC-BY,75,upper extremity,benign,11.10,True,solar lentigo,histopathology,dermoscopic,,,,,,True,male
ISIC_0265494,Memorial Sloan Kettering Cancer Center,CC-BY,70,anterior torso,benign,8.50,True,nevus,histopathology,dermoscopic,,,,,,True,male
ISIC_0280376,Memorial Sloan Kettering Cancer Center,CC-BY,70,anterior torso,benign,9.00,True,lichenoid keratosis,histopathology,dermoscopic,,,,,,False,male
ISIC_0289271,Memorial Sloan Kettering Cancer Center,CC-BY,70,upper extremity,benign,10.40,True,solar lentigo,histopathology,dermoscopic,,,,,,True,female
ISIC_0290144,Memorial Sloan Kettering Cancer Center,CC-BY,65,lower extremity,benign,6.00,True,atypical melanocytic proliferation,histopathology,dermoscopic,,,,,,True,male
ISIC_0295083,Memorial Sloan Kettering Cancer Center,CC-BY,55,upper extremity,benign,7.00,True,nevus,histopathology,dermoscopic,,,,,,True,male
ISIC_0307984,Memorial Sloan Kettering Cancer Center,CC-BY,70,upper extremity,benign,3.50,True,seborrheic keratosis,histopathology,dermoscopic,,,,,,False,male
ISIC_0310134,Memorial Sloan Kettering Cancer Center,CC-BY,40,anterior torso,benign,2.30,True,nevus,histopathology,dermoscopic,,,,,,True,female
ISIC_0314083,Memorial Sloan Kettering Cancer Center,CC-BY,60,head/neck,benign,8.30,True,solar lentigo,histopathology,dermoscopic,,,,,,True,female
ISIC_0322660,Memorial Sloan Kettering Cancer Center,CC-BY,35,upper extremity,benign,3.40,True,nevus,histopathology,dermoscopic,,,,,,True,female
ISIC_0327790,Memorial Sloan Kettering Cancer Center,CC-BY,50,lower extremity,benign,2.80,True,nevus,histopathology,dermoscopic,,,,,,True,female
ISIC_0353247,Memorial Sloan Kettering Cancer Center,CC-BY,80,lower extremity,malignant,6.90,True,melanoma,histopathology,dermoscopic,melanoma in situ,,,superficial spreading melanoma,,True,female
ISIC_0357905,Memorial Sloan Kettering Cancer Center,CC-BY,50,upper extremity,benign,11.30,True,seborrheic keratosis,histopathology,dermoscopic,,,,,,False,female
ISIC_0371997,Memorial Sloan Kettering Cancer Center,CC-BY,75,lower extremity,benign,16.70,True,solar lentigo,histopathology,dermoscopic,,,,,,True,female
ISIC_0376071,Memorial Sloan Kettering Cancer Center,CC-BY,45,upper extremity,benign,2.80,True,nevus,histopathology,dermoscopic,,,,,,True,female
ISIC_0399142,Memorial Sloan Kettering Cancer Center,CC-BY,45,upper extremity,benign,4.00,True,nevus,histopathology,dermoscopic,,,,,,True,female
ISIC_0401647,Memorial Sloan Kettering Cancer Center,CC-BY,65,upper extremity,benign,2.40,True,solar lentigo,histopathology,dermoscopic,,,,,,True,female
ISIC_0416709,Memorial Sloan Kettering Cancer Center,CC-BY,40,lower extremity,benign,2.20,True,nevus,histopathology,dermoscopic,,,,,,True,female
ISIC_0423655,Memorial Sloan Kettering Cancer Center,CC-BY,70,upper extremity,benign,6.30,True,nevus,histopathology,dermoscopic,,,,,,True,male
ISIC_0428084,Memorial Sloan Kettering Cancer Center,CC-BY,55,lower extremity,benign,10.30,True,vascular lesion,histopathology,dermoscopic,,,,,,False,male
ISIC_0429825,Memorial Sloan Kettering Cancer Center,CC-BY,65,anterior torso,malignant,5.60,True,melanoma,histopathology,dermoscopic,invasive melanoma,0/mm^2,0.50,,False,True,male
ISIC_0437036,Memorial Sloan Kettering Cancer Center,CC-BY,35,anterior torso,benign,4.90,True,nevus,histopathology,dermoscopic,,,,,,True,female
ISIC_0443195,Memorial Sloan Kettering Cancer Center,CC-BY,30,upper extremity,benign,4.40,True,nevus,histopathology,dermoscopic,,,,,,True,female
ISIC_0444602,Memorial Sloan Kettering Cancer Center,CC-BY,50,lower extremity,benign,1.70,True,nevus,histopathology,dermoscopic,,,,,,True,female
ISIC_0446437,Memorial Sloan Kettering Cancer Center,CC-BY,50,posterior torso,benign,12.30,True,nevus,histopathology,dermoscopic,,,,,,True,female
ISIC_0453394,Memorial Sloan Kettering Cancer Center,CC-BY,65,lower extremity,benign,2.50,True,actinic keratosis,histopathology,dermoscopic,,,,,,False,female
ISIC_0457683,Memorial Sloan Kettering Cancer Center,CC-BY,55,anterior torso,benign,3.50,True,nevus,histopathology,dermoscopic,,,,,,True,male
ISIC_0464707,Memorial Sloan Kettering Cancer Center,CC-BY,70,head/neck,benign,7.80,True,actinic keratosis,histopathology,dermoscopic,,,,,,False,female
ISIC_0468002,Memorial Sloan Kettering Cancer Center,CC-BY,50,lower extremity,benign,4.50,True,lentigo simplex,histopathology,dermoscopic,,,,,,True,female
ISIC_0470037,Memorial Sloan Kettering Cancer Center,CC-BY,85,posterior torso,benign,6.70,True,nevus,histopathology,dermoscopic,,,,,,True,male
ISIC_0472351,Memorial Sloan Kettering Cancer Center,CC-BY,55,anterior torso,benign,3.70,True,nevus,histopathology,dermoscopic,,,,,,True,male
ISIC_0473709,Memorial Sloan Kettering Cancer Center,CC-BY,65,anterior torso,benign,5.30,True,nevus,histopathology,dermoscopic,,,,,,True,female
ISIC_0478979,Memorial Sloan Kettering Cancer Center,CC-BY,80,upper extremity,benign,13.40,True,lentigo NOS,histopathology,dermoscopic,,,,,,True,male
ISIC_0483530,Memorial Sloan Kettering Cancer Center,CC-BY,15,head/neck,benign,3.90,True,nevus,histopathology,dermoscopic,,,,,,True,female
ISIC_0489982,Memorial Sloan Kettering Cancer Center,CC-BY,60,lower extremity,benign,2.90,True,nevus,histopathology,dermoscopic,,,,,,True,female
ISIC_0494909,Memorial Sloan Kettering Cancer Center,CC-BY,75,lower extremity,benign,2.40,True,nevus,histopathology,dermoscopic,,,,,,True,male
ISIC_0501108,Memorial Sloan Kettering Cancer Center,CC-BY,75,head/neck,malignant,4.00,True,melanoma,histopathology,dermoscopic,melanoma in situ,,,lentigo maligna melanoma,,True,female
ISIC_0511862,Memorial Sloan Kettering Cancer Center,CC-BY,45,head/neck,benign,4.30,True,nevus,histopathology,dermoscopic,,,,,,True,female
ISIC_0514777,Memorial Sloan Kettering Cancer Center,CC-BY,75,lower extremity,benign,5.10,True,verruca,histopathology,dermoscopic,,,,,,False,female
ISIC_0517084,Memorial Sloan Kettering Cancer Center,CC-BY,65,posterior torso,benign,3.00,True,nevus,histopathology,dermoscopic,,,,,,True,female
ISIC_0520674,Memorial Sloan Kettering Cancer Center,CC-BY,55,upper extremity,benign,3.70,True,nevus,histopathology,dermoscopic,,,,,,True,female
ISIC_0525932,Memorial Sloan Kettering Cancer Center,CC-BY,35,anterior torso,benign,4.30,True,nevus,histopathology,dermoscopic,,,,,,True,female
ISIC_0536439,Memorial Sloan Kettering Cancer Center,CC-BY,50,lower extremity,benign,3.00,True,lentigo NOS,histopathology,dermoscopic,,,,,,True,male
ISIC_0545679,Memorial Sloan Kettering Cancer Center,CC-BY,50,upper extremity,benign,5.50,True,nevus,histopathology,dermoscopic,,,,,,True,male
ISIC_0552701,Memorial Sloan Kettering Cancer Center,CC-BY,45,lower extremity,benign,3.90,True,nevus,histopathology,dermoscopic,,,,,,True,female
ISIC_0555938,Memorial Sloan Kettering Cancer Center,CC-BY,80,lower extremity,benign,7.40,True,lentigo NOS,histopathology,dermoscopic,,,,,,True,male
ISIC_0557560,Memorial Sloan Kettering Cancer Center,CC-BY,65,upper extremity,indeterminate,3.20,True,atypical melanocytic proliferation,histopathology,dermoscopic,,,,,,True,female
ISIC_0565639,Memorial Sloan Kettering Cancer Center,CC-BY,30,anterior torso,benign,6.50,True,nevus,histopathology,dermoscopic,,,,,,True,male
ISIC_0567265,Memorial Sloan Kettering Cancer Center,CC-BY,55,upper extremity,benign,9.10,True,solar lentigo,histopathology,dermoscopic,,,,,,True,female
ISIC_0587266,Memorial Sloan Kettering Cancer Center,CC-BY,60,lower extremity,benign,4.90,True,nevus,histopathology,dermoscopic,,,,,,True,female
ISIC_0591484,Memorial Sloan Kettering Cancer Center,CC-BY,25,posterior torso,benign,6.00,True,nevus,histopathology,dermoscopic,,,,,,True,female
ISIC_0592761,Memorial Sloan Kettering Cancer Center,CC-BY,70,anterior torso,benign,11.90,True,solar lentigo,histopathology,dermoscopic,,,,,,True,female
ISIC_0593159,Memorial Sloan Kettering Cancer Center,CC-BY,65,upper extremity,benign,8.40,True,atypical melanocytic proliferation,histopathology,dermoscopic,,,,,,False,male
ISIC_0597218,Memorial Sloan Kettering Cancer Center,CC-BY,55,posterior torso,benign,6.50,True,nevus,histopathology,dermoscopic,,,,,,True,female
ISIC_0601638,Memorial Sloan Kettering Cancer Center,CC-BY,70,lower extremity,benign,5.50,True,nevus,histopathology,dermoscopic,,,,,,True,female
ISIC_0602893,Memorial Sloan Kettering Cancer Center,CC-BY,50,anterior torso,benign,11.70,True,solar lentigo,histopathology,dermoscopic,,,,,,True,female
ISIC_0604571,Memorial Sloan Kettering Cancer Center,CC-BY,75,upper extremity,benign,7.70,True,lichenoid keratosis,histopathology,dermoscopic,,,,,,False,female
ISIC_0605858,Memorial Sloan Kettering Cancer Center,CC-BY,45,lower extremity,benign,2.70,True,nevus,histopathology,dermoscopic,,,,,,True,female
ISIC_0612638,Memorial Sloan Kettering Cancer Center,CC-BY,65,upper extremity,benign,15.50,True,solar lentigo,histopathology,dermoscopic,,,,,,True,male
ISIC_0632983,Memorial Sloan Kettering Cancer Center,CC-BY,50,posterior torso,benign,3.10,True,nevus,histopathology,dermoscopic,,,,,,True,female
ISIC_0645477,Memorial Sloan Kettering Cancer Center,CC-BY,75,anterior torso,benign,11.70,True,nevus,histopathology,dermoscopic,,,,,,True,female
ISIC_0651512,Memorial Sloan Kettering Cancer Center,CC-BY,65,posterior torso,benign,15.00,True,solar lentigo,histopathology,dermoscopic,,,,,,True,female
ISIC_0663387,Memorial Sloan Kettering Cancer Center,CC-BY,40,head/neck,benign,9.30,True,nevus,histopathology,dermoscopic,,,,,,True,female
ISIC_0668612,Memorial Sloan Kettering Cancer Center,CC-BY,55,anterior torso,benign,16.60,True,lichenoid keratosis,histopathology,dermoscopic,,,,,,False,female
ISIC_0669355,Memorial Sloan Kettering Cancer Center,CC-BY,45,posterior torso,benign,4.50,True,nevus,histopathology,dermoscopic,,,,,,True,female
ISIC_0673811,Memorial Sloan Kettering Cancer Center,CC-BY,65,anterior torso,indeterminate,5.90,True,atypical melanocytic proliferation,histopathology,dermoscopic,,,,,,True,male
ISIC_0690744,Memorial Sloan Kettering Cancer Center,CC-BY,75,posterior torso,benign,7.60,True,nevus,histopathology,dermoscopic,,,,,,True,male
ISIC_0702665,Memorial Sloan Kettering Cancer Center,CC-BY,70,posterior torso,indeterminate,8.20,True,nevus,histopathology,dermoscopic,,,,,,True,male
ISIC_0706692,Memorial Sloan Kettering Cancer Center,CC-BY,70,lower extremity,benign,5.90,True,nevus,histopathology,dermoscopic,,,,,,True,male
ISIC_0709809,Memorial Sloan Kettering Cancer Center,CC-BY,55,lower extremity,benign,4.90,True,nevus,histopathology,dermoscopic,,,,,,True,female
ISIC_0717152,Memorial Sloan Kettering Cancer Center,CC-BY,75,head/neck,benign,18.10,True,actinic keratosis,histopathology,dermoscopic,,,,,,False,male
ISIC_0737161,Memorial Sloan Kettering Cancer Center,CC-BY,55,anterior torso,benign,4.50,True,seborrheic keratosis,histopathology,dermoscopic,,,,,,False,male
ISIC_0749853,Memorial Sloan Kettering Cancer Center,CC-BY,65,lower extremity,benign,7.00,True,lichenoid keratosis,histopathology,dermoscopic,,,,,,False,female
ISIC_0760717,Memorial Sloan Kettering Cancer Center,CC-BY,45,upper extremity,benign,3.70,True,nevus,histopathology,dermoscopic,,,,,,True,female
ISIC_0767110,Memorial Sloan Kettering Cancer Center,CC-BY,60,lower extremity,benign,3.70,True,nevus,histopathology,dermoscopic,,,,,,True,female
ISIC_0777975,Memorial Sloan Kettering Cancer Center,CC-BY,55,upper extremity,indeterminate,6.10,True,nevus,histopathology,dermoscopic,,,,,,True,female
ISIC_0783513,Memorial Sloan Kettering Cancer Center,CC-BY,55,lower extremity,benign,4.70,True,nevus,histopathology,dermoscopic,,,,,,True,female
ISIC_0786784,Memorial Sloan Kettering Cancer Center,CC-BY,40,posterior torso,benign,4.90,True,nevus,histopathology,dermoscopic,,,,,,True,female
ISIC_0799487,Memorial Sloan Kettering Cancer Center,CC-BY,55,lower extremity,benign,3.40,True,dermatofibroma,histopathology,dermoscopic,,,,,,False,female
ISIC_0839447,Memorial Sloan Kettering Cancer Center,CC-BY,70,lower extremity,benign,4.30,True,nevus,histopathology,dermoscopic,,,,,,True,female
ISIC_0855174,Memorial Sloan Kettering Cancer Center,CC-BY,55,lower extremity,malignant,13.60,True,melanoma,histopathology,dermoscopic,melanoma in situ,,,,,True,male
ISIC_0862350,Memorial Sloan Kettering Cancer Center,CC-BY,60,head/neck,malignant,8.20,True,basal cell carcinoma,histopathology,dermoscopic,,,,,,False,male
ISIC_0865706,Memorial Sloan Kettering Cancer Center,CC-BY,40,lateral torso,benign,6.30,True,nevus,histopathology,dermoscopic,,,,,,True,female
ISIC_0868067,Memorial Sloan Kettering Cancer Center,CC-BY,70,anterior torso,benign,10.50,True,nevus,histopathology,dermoscopic,,,,,,True,male
ISIC_0875614,Memorial Sloan Kettering Cancer Center,CC-BY,50,lower extremity,benign,3.90,True,actinic keratosis,histopathology,dermoscopic,,,,,,False,female
ISIC_0890978,Memorial Sloan Kettering Cancer Center,CC-BY,70,head/neck,indeterminate,8.20,True,AIMP,histopathology,dermoscopic,,,,,,True,male
ISIC_0903411,Memorial Sloan Kettering Cancer Center,CC-BY,70,head/neck,malignant,9.10,True,melanoma,histopathology,dermoscopic,melanoma in situ,,,,,True,male
ISIC_0905367,Memorial Sloan Kettering Cancer Center,CC-BY,40,lower extremity,benign,12.90,True,nevus,histopathology,dermoscopic,,,,,,True,female
ISIC_0916205,Memorial Sloan Kettering Cancer Center,CC-BY,50,lower extremity,benign,4.50,True,nevus,histopathology,dermoscopic,,,,,,True,female
ISIC_0925325,Memorial Sloan Kettering Cancer Center,CC-BY,35,upper extremity,benign,4.80,True,nevus,histopathology,dermoscopic,,,,,,True,male
ISIC_0933158,Memorial Sloan Kettering Cancer Center,CC-BY,85,lower extremity,benign,4.80,True,atypical melanocytic proliferation,histopathology,dermoscopic,,,,,,True,female
ISIC_0939958,Memorial Sloan Kettering Cancer Center,CC-BY,80,lower extremity,benign,5.40,True,nevus,histopathology,dermoscopic,,,,,,True,female
ISIC_0962121,Memorial Sloan Kettering Cancer Center,CC-BY,65,upper extremity,malignant,7.90,True,melanoma,histopathology,dermoscopic,invasive melanoma,,0.20,superficial spreading melanoma,False,True,male
ISIC_0972869,Memorial Sloan Kettering Cancer Center,CC-BY,30,posterior torso,benign,5.30,True,nevus,histopathology,dermoscopic,,,,,,True,female
ISIC_0990298,Memorial Sloan Kettering Cancer Center,CC-BY,55,upper extremity,malignant,9.60,True,melanoma,histopathology,dermoscopic,melanoma in situ,,,superficial spreading melanoma,,True,male
ISIC_0992261,Memorial Sloan Kettering Cancer Center,CC-BY,60,posterior torso,benign,7.60,True,nevus,histopathology,dermoscopic,,,,,,True,female
ISIC_0998962,Memorial Sloan Kettering Cancer Center,CC-BY,60,anterior torso,malignant,9.70,True,melanoma,histopathology,dermoscopic,melanoma in situ,,,superficial spreading melanoma,,True,male
ISIC_1001430,Memorial Sloan Kettering Cancer Center,CC-BY,60,upper extremity,benign,3.10,True,nevus,histopathology,dermoscopic,,,,,,True,female
ISIC_1003059,Memorial Sloan Kettering Cancer Center,CC-BY,50,upper extremity,benign,3.00,True,nevus,histopathology,dermoscopic,,,,,,True,female
ISIC_1027132,Memorial Sloan Kettering Cancer Center,CC-BY,50,anterior torso,benign,6.60,True,nevus,histopathology,dermoscopic,,,,,,True,male
ISIC_1028374,Memorial Sloan Kettering Cancer Center,CC-BY,55,lower extremity,benign,3.70,True,nevus,histopathology,dermoscopic,,,,,,True,female
ISIC_1040820,Memorial Sloan Kettering Cancer Center,CC-BY,75,head/neck,malignant,4.00,True,melanoma,histopathology,dermoscopic,melanoma in situ,,,lentigo maligna melanoma,,True,male
ISIC_1071783,Memorial Sloan Kettering Cancer Center,CC-BY,55,anterior torso,benign,8.10,True,lichenoid keratosis,histopathology,dermoscopic,,,,,,False,female
ISIC_1085658,Memorial Sloan Kettering Cancer Center,CC-BY,65,upper extremity,benign,4.40,True,nevus,histopathology,dermoscopic,,,,,,True,male
ISIC_1089173,Memorial Sloan Kettering Cancer Center,CC-BY,25,anterior torso,benign,4.40,True,nevus,histopathology,dermoscopic,,,,,,True,female
ISIC_1099075,Memorial Sloan Kettering Cancer Center,CC-BY,60,lower extremity,malignant,9.50,True,melanoma,histopathology,dermoscopic,melanoma in situ,,,,,True,female
ISIC_1099767,Memorial Sloan Kettering Cancer Center,CC-BY,65,lower extremity,benign,6.20,True,dermatofibroma,histopathology,dermoscopic,,,,,,False,male
ISIC_1111109,Memorial Sloan Kettering Cancer Center,CC-BY,50,lower extremity,benign,4.40,True,nevus,histopathology,dermoscopic,,,,,,True,male
ISIC_1126550,Memorial Sloan Kettering Cancer Center,CC-BY,40,lower extremity,benign,16.60,True,seborrheic keratosis,histopathology,dermoscopic,,,,,,False,male
ISIC_1142182,Memorial Sloan Kettering Cancer Center,CC-BY,25,head/neck,benign,2.50,True,nevus,histopathology,dermoscopic,,,,,,True,male
ISIC_1146051,Memorial Sloan Kettering Cancer Center,CC-BY,60,posterior torso,benign,12.30,True,nevus,histopathology,dermoscopic,,,,,,True,male
ISIC_1160972,Memorial Sloan Kettering Cancer Center,CC-BY,60,upper extremity,benign,6.30,True,lentigo NOS,histopathology,dermoscopic,,,,,,True,male
ISIC_1176074,Memorial Sloan Kettering Cancer Center,CC-BY,40,upper extremity,benign,4.10,True,nevus,histopathology,dermoscopic,,,,,,True,female
ISIC_1205301,Memorial Sloan Kettering Cancer Center,CC-BY,60,upper extremity,benign,5.90,True,solar lentigo,histopathology,dermoscopic,,,,,,True,male
ISIC_1206086,Memorial Sloan Kettering Cancer Center,CC-BY,40,posterior torso,benign,3.40,True,nevus,histopathology,dermoscopic,,,,,,True,male
ISIC_1208163,Memorial Sloan Kettering Cancer Center,CC-BY,65,lower extremity,benign,2.50,True,nevus,histopathology,dermoscopic,,,,,,True,female
ISIC_1212149,Memorial Sloan Kettering Cancer Center,CC-BY,80,anterior torso,benign,7.40,True,nevus,histopathology,dermoscopic,,,,,,True,male
ISIC_1214018,Memorial Sloan Kettering Cancer Center,CC-BY,65,upper extremity,benign,10.60,True,solar lentigo,histopathology,dermoscopic,,,,,,True,female
ISIC_1214159,Memorial Sloan Kettering Cancer Center,CC-BY,55,upper extremity,benign,6.50,True,nevus,histopathology,dermoscopic,,,,,,True,female
ISIC_1217200,Memorial Sloan Kettering Cancer Center,CC-BY,45,lower extremity,benign,3.10,True,nevus,histopathology,dermoscopic,,,,,,True,female
ISIC_1241834,Memorial Sloan Kettering Cancer Center,CC-BY,70,head/neck,benign,1.90,True,actinic keratosis,histopathology,dermoscopic,,,,,,False,male
ISIC_1253099,Memorial Sloan Kettering Cancer Center,CC-BY,45,posterior torso,benign,5.00,True,nevus,histopathology,dermoscopic,,,,,,True,female
ISIC_1257579,Memorial Sloan Kettering Cancer Center,CC-BY,70,anterior torso,benign,14.90,True,vascular lesion,histopathology,dermoscopic,,,,,,False,male
ISIC_1259169,Memorial Sloan Kettering Cancer Center,CC-BY,55,lower extremity,benign,3.70,True,nevus,histopathology,dermoscopic,,,,,,True,female
ISIC_1277350,Memorial Sloan Kettering Cancer Center,CC-BY,70,lower extremity,benign,5.40,True,lentigo NOS,histopathology,dermoscopic,,,,,,True,female
ISIC_1284958,Memorial Sloan Kettering Cancer Center,CC-BY,50,head/neck,benign,8.40,True,,histopathology,dermoscopic,,,,,,,male
ISIC_1298339,Memorial Sloan Kettering Cancer Center,CC-BY,50,head/neck,benign,9.10,True,lentigo NOS,histopathology,dermoscopic,,,,,,True,female
ISIC_1305755,Memorial Sloan Kettering Cancer Center,CC-BY,45,anterior torso,indeterminate,6.00,True,AIMP,histopathology,dermoscopic,,,,,,True,female
ISIC_1327512,Memorial Sloan Kettering Cancer Center,CC-BY,75,head/neck,benign,4.50,True,seborrheic keratosis,histopathology,dermoscopic,,,,,,False,male