isic_id,attribution,copyright_license,acquisition_day,age_approx,anatom_site_general,benign_malignant,clin_size_long_diam_mm,concomitant_biopsy,dermoscopic_type,diagnosis,diagnosis_confirm_type,family_hx_mm,fitzpatrick_skin_type,image_type,lesion_id,mel_class,mel_thick_mm,mel_ulcer,melanocytic,nevus_type,patient_id,personal_hx_mm,sex
ISIC_0080539,Memorial Sloan Kettering Cancer Center,CC-0,1,50,head/neck,malignant,5.40,True,contact polarized,melanoma,histopathology,True,III,dermoscopic,IL_6342582,melanoma in situ,,,True,,IP_5440286,True,female
ISIC_0098024,Memorial Sloan Kettering Cancer Center,CC-0,1,65,upper extremity,benign,4.90,True,contact polarized,lichenoid keratosis,histopathology,False,III,dermoscopic,IL_2556082,,,,False,,IP_0680784,False,male
ISIC_0131983,Memorial Sloan Kettering Cancer Center,CC-0,1,85,posterior torso,benign,4.00,True,contact polarized,nevus,histopathology,False,II,dermoscopic,IL_5424222,,,,True,,IP_7498505,False,male
ISIC_0134155,Memorial Sloan Kettering Cancer Center,CC-0,1,35,head/neck,benign,7.30,True,contact polarized,lentigo NOS,histopathology,False,III,dermoscopic,IL_2907315,,,,True,,IP_1924080,False,male
ISIC_0155910,Memorial Sloan Kettering Cancer Center,CC-0,1,75,head/neck,benign,2.70,True,contact polarized,lentigo NOS,histopathology,True,II,dermoscopic,IL_2102236,,,,True,,IP_3792900,True,male
ISIC_0178370,Memorial Sloan Kettering Cancer Center,CC-0,1,80,posterior torso,benign,8.20,True,contact polarized,nevus,histopathology,False,III,dermoscopic,IL_2802861,,,,True,,IP_8819261,True,male
ISIC_0202119,Memorial Sloan Kettering Cancer Center,CC-0,1,40,lower extremity,malignant,4.20,True,contact polarized,melanoma,histopathology,True,II,dermoscopic,IL_5852213,invasive melanoma,0.40,False,True,,IP_0916785,True,female
ISIC_0206604,Memorial Sloan Kettering Cancer Center,CC-0,1,65,posterior torso,indeterminate/benign,4.50,True,non-contact polarized,atypical melanocytic proliferation,histopathology,False,III,dermoscopic,IL_0479202,,,,True,,IP_4597513,True,male
ISIC_0211399,Memorial Sloan Kettering Cancer Center,CC-0,244,75,anterior torso,benign,5.70,True,contact polarized,nevus,histopathology,False,II,dermoscopic,IL_9198580,,,,True,,IP_1764181,True,female
ISIC_0235696,Memorial Sloan Kettering Cancer Center,CC-0,1,65,anterior torso,malignant,7.10,True,contact polarized,melanoma,histopathology,False,III,dermoscopic,IL_0346398,invasive melanoma,0.45,False,True,,IP_4853824,False,male
ISIC_0261253,Memorial Sloan Kettering Cancer Center,CC-0,1,65,upper extremity,malignant,15.10,True,contact polarized,melanoma,histopathology,True,I,dermoscopic,IL_2413085,invasive melanoma,0.30,,True,,IP_6924850,True,male
ISIC_0282371,Memorial Sloan Kettering Cancer Center,CC-0,1,70,head/neck,indeterminate/benign,9.60,True,contact polarized,atypical melanocytic proliferation,histopathology,True,II,dermoscopic,IL_7890160,,,,True,,IP_6200159,False,female
ISIC_0283070,Memorial Sloan Kettering Cancer Center,CC-0,1,85,lower extremity,benign,2.90,True,contact polarized,nevus,histopathology,True,II,dermoscopic,IL_4046290,,,,True,,IP_9653442,True,female
ISIC_0292899,Memorial Sloan Kettering Cancer Center,CC-0,1,60,head/neck,indeterminate/malignant,8.60,True,contact polarized,melanoma,histopathology,True,I,dermoscopic,IL_3716388,melanoma in situ,,,True,,IP_1083924,True,female
ISIC_0310853,Memorial Sloan Kettering Cancer Center,CC-0,1,60,head/neck,benign,17.20,True,contact polarized,lentigo NOS,histopathology,True,II,dermoscopic,IL_2031685,,,,True,,IP_9194333,False,female
ISIC_0324472,Memorial Sloan Kettering Cancer Center,CC-0,1,25,posterior torso,indeterminate/benign,5.60,True,contact polarized,nevus,histopathology,False,II,dermoscopic,IL_6582114,,,,True,,IP_7349538,False,female
ISIC_0345607,Memorial Sloan Kettering Cancer Center,CC-0,1,75,lower extremity,benign,6.00,True,contact polarized,seborrheic keratosis,histopathology,False,II,dermoscopic,IL_9403579,,,,False,,IP_5633167,True,male
ISIC_0346815,Memorial Sloan Kettering Cancer Center,CC-0,1,75,upper extremity,malignant,10.00,True,,melanoma,histopathology,False,II,dermoscopic,IL_2268391,invasive melanoma,1.00,False,True,,IP_5653891,True,female
ISIC_0375034,Memorial Sloan Kettering Cancer Center,CC-0,2928,55,posterior torso,malignant,10.10,True,,melanoma,histopathology,True,III,dermoscopic,IL_5454547,invasive melanoma,0.40,False,True,,IP_8313778,True,male
ISIC_0390071,Memorial Sloan Kettering Cancer Center,CC-0,1,55,posterior torso,benign,10.80,True,contact polarized,seborrheic keratosis,histopathology,True,II,dermoscopic,IL_2163165,,,,False,,IP_5980386,True,female
ISIC_0413563,Memorial Sloan Kettering Cancer Center,CC-0,1,70,upper extremity,malignant,11.70,True,,melanoma,histopathology,False,II,dermoscopic,IL_0723835,invasive melanoma,0.20,,True,,IP_2014423,False,male
ISIC_0429987,Memorial Sloan Kettering Cancer Center,CC-0,1,45,upper extremity,benign,7.10,True,non-contact polarized,nevus,histopathology,False,II,dermoscopic,IL_9451834,,,,True,,IP_2099877,False,male
ISIC_0435215,Memorial Sloan Kettering Cancer Center,CC-0,1,65,lateral torso,indeterminate/benign,11.00,True,contact polarized,atypical melanocytic proliferation,histopathology,False,I,dermoscopic,IL_7912497,,,,True,,IP_5532748,True,male
ISIC_0437256,Memorial Sloan Kettering Cancer Center,CC-0,1,60,lower extremity,benign,4.60,True,contact polarized,nevus,histopathology,False,II,dermoscopic,IL_7003382,,,,True,,IP_3124248,False,female
ISIC_0464270,Memorial Sloan Kettering Cancer Center,CC-0,1,70,lower extremity,benign,6.60,True,contact polarized,lentigo NOS,histopathology,False,III,dermoscopic,IL_4490560,,,,True,,IP_7894934,True,female
ISIC_0465400,Memorial Sloan Kettering Cancer Center,CC-0,1,30,posterior torso,benign,5.20,True,contact polarized,nevus,histopathology,True,III,dermoscopic,IL_8728500,,,,True,,IP_7666532,False,female
ISIC_0475038,Memorial Sloan Kettering Cancer Center,CC-0,1,75,posterior torso,benign,7.20,True,contact polarized,nevus,histopathology,True,III,dermoscopic,IL_2962194,,,,True,,IP_6975468,False,male
ISIC_0476728,Memorial Sloan Kettering Cancer Center,CC-0,1,70,posterior torso,benign,15.50,True,non-contact polarized,seborrheic keratosis,histopathology,False,I,dermoscopic,IL_7694612,,,,True,,IP_2768316,True,female
ISIC_0495210,Memorial Sloan Kettering Cancer Center,CC-0,1,25,anterior torso,benign,15.10,True,contact polarized,nevus,histopathology,False,I,dermoscopic,IL_7701473,,,,True,,IP_5357927,True,female
ISIC_0498990,Memorial Sloan Kettering Cancer Center,CC-0,1,30,posterior torso,benign,5.60,True,contact polarized,nevus,histopathology,True,II,dermoscopic,IL_5446220,,,,True,,IP_8333628,False,male
ISIC_0503442,Memorial Sloan Kettering Cancer Center,CC-0,1,50,palms/soles,benign,4.10,True,contact polarized,nevus,histopathology,True,II,dermoscopic,IL_3129676,,,,True,,IP_9131471,True,female
ISIC_0510774,Memorial Sloan Kettering Cancer Center,CC-0,1,50,anterior torso,benign,11.10,True,contact polarized,nevus,histopathology,False,III,dermoscopic,IL_9484535,,,,True,,IP_6489650,False,female
ISIC_0513012,Memorial Sloan Kettering Cancer Center,CC-0,1,70,anterior torso,benign,3.40,True,contact polarized,nevus,histopathology,False,III,dermoscopic,IL_6437037,,,,True,,IP_6509091,False,female
ISIC_0555848,Memorial Sloan Kettering Cancer Center,CC-0,1,50,upper extremity,indeterminate/benign,6.80,True,contact polarized,atypical melanocytic proliferation,histopathology,True,II,dermoscopic,IL_9486656,,,,True,,IP_9442934,False,female
ISIC_0558656,Memorial Sloan Kettering Cancer Center,CC-0,1,60,lower extremity,benign,9.50,True,,nevus,histopathology,True,I,dermoscopic,IL_3631383,,,,True,,IP_1083924,True,female
ISIC_0582421,Memorial Sloan Kettering Cancer Center,CC-0,1,55,posterior torso,benign,8.40,True,,nevus,histopathology,False,III,dermoscopic,IL_4585051,,,,True,,IP_7525385,True,female
ISIC_0614911,Memorial Sloan Kettering Cancer Center,CC-0,1,55,posterior torso,benign,4.90,True,contact polarized,nevus,histopathology,True,III,dermoscopic,IL_6470073,,,,True,,IP_8039173,False,male
ISIC_0639571,Memorial Sloan Kettering Cancer Center,CC-0,1,80,upper extremity,benign,7.50,True,contact polarized,actinic keratosis,histopathology,False,III,dermoscopic,IL_5301196,,,,False,,IP_9712745,True,male
ISIC_0648545,Memorial Sloan Kettering Cancer Center,CC-0,1,85,upper extremity,malignant,12.60,True,contact polarized,melanoma,histopathology,False,II,dermoscopic,IL_3035170,invasive melanoma,0.80,False,True,,IP_0697119,False,male
ISIC_0657897,Memorial Sloan Kettering Cancer Center,CC-0,1,25,lower extremity,benign,5.40,True,contact polarized,nevus,histopathology,True,II,dermoscopic,IL_1955791,,,,True,,IP_3158554,False,male
ISIC_0665750,Memorial Sloan Kettering Cancer Center,CC-0,1,55,upper extremity,benign,11.10,True,contact polarized,lentigo NOS,histopathology,False,II,dermoscopic,IL_9852467,,,,True,,IP_1821795,False,female
ISIC_0672006,Memorial Sloan Kettering Cancer Center,CC-0,1,80,head/neck,indeterminate/benign,8.70,True,contact polarized,atypical melanocytic proliferation,histopathology,False,II,dermoscopic,IL_4545733,,,,True,,IP_4297780,False,male
ISIC_0686366,Memorial Sloan Kettering Cancer Center,CC-0,1,75,anterior torso,benign,6.90,True,contact polarized,lentigo NOS,histopathology,False,II,dermoscopic,IL_1839262,,,,True,,IP_3516181,False,male
ISIC_0705477,Memorial Sloan Kettering Cancer Center,CC-0,1,60,upper extremity,malignant,7.30,True,non-contact polarized,melanoma,histopathology,True,II,dermoscopic,IL_9724781,invasive melanoma,0.50,False,True,,IP_3015474,False,male
ISIC_0743395,Memorial Sloan Kettering Cancer Center,CC-0,1,55,upper extremity,benign,4.30,True,contact polarized,nevus,histopathology,False,III,dermoscopic,IL_0361337,,,,True,,IP_1981263,False,female
ISIC_0773886,Memorial Sloan Kettering Cancer Center,CC-0,99,70,head/neck,benign,14.40,True,contact polarized,actinic keratosis,histopathology,False,I,dermoscopic,IL_3695511,,,,False,,IP_6575300,True,male
ISIC_0806140,Memorial Sloan Kettering Cancer Center,CC-0,1,20,posterior torso,benign,9.10,True,contact polarized,nevus,histopathology,True,II,dermoscopic,IL_7816327,,,,True,,IP_7919791,False,female
ISIC_0807504,Memorial Sloan Kettering Cancer Center,CC-0,1,60,anterior torso,benign,10.60,True,contact polarized,nevus,histopathology,True,III,dermoscopic,IL_6412416,,,,True,,IP_7412246,False,female
ISIC_0808203,Memorial Sloan Kettering Cancer Center,CC-0,1,60,upper extremity,malignant,7.50,True,,basal cell carcinoma,histopathology,True,I,dermoscopic,IL_5395392,,,,False,,IP_8042714,False,male
ISIC_0820400,Memorial Sloan Kettering Cancer Center,CC-0,1,70,lower extremity,benign,5.90,True,contact polarized,seborrheic keratosis,histopathology,False,III,dermoscopic,IL_9417612,,,,False,,IP_3174780,False,male
ISIC_0848012,Memorial Sloan Kettering Cancer Center,CC-0,2497,55,anterior torso,benign,6.60,True,contact polarized,nevus,histopathology,True,IV,dermoscopic,IL_3480492,,,,True,,IP_9563768,True,female
ISIC_0900188,Memorial Sloan Kettering Cancer Center,CC-0,1,60,lower extremity,benign,4.60,True,non-contact polarized,nevus,histopathology,False,III,dermoscopic,IL_9171087,,,,True,,IP_9673587,False,female
ISIC_0901635,Memorial Sloan Kettering Cancer Center,CC-0,1676,35,anterior torso,benign,8.90,True,contact polarized,nevus,histopathology,False,III,dermoscopic,IL_6754800,,,,True,,IP_5549010,False,female
ISIC_0908291,Memorial Sloan Kettering Cancer Center,CC-0,1,55,head/neck,benign,6.30,True,contact polarized,nevus,histopathology,True,III,dermoscopic,IL_1113358,,,,True,,IP_9383306,True,female
ISIC_0923581,Memorial Sloan Kettering Cancer Center,CC-0,1,50,posterior torso,benign,3.20,True,contact polarized,nevus,histopathology,False,II,dermoscopic,IL_3609360,,,,True,,IP_8193249,True,female
ISIC_0928328,Memorial Sloan Kettering Cancer Center,CC-0,1,55,lower extremity,benign,6.10,True,non-contact polarized,nevus,histopathology,True,II,dermoscopic,IL_4497004,,,,True,,IP_5781199,False,female
ISIC_0968773,Memorial Sloan Kettering Cancer Center,CC-0,1,50,upper extremity,benign,4.00,True,contact polarized,seborrheic keratosis,histopathology,True,II,dermoscopic,IL_8448467,,,,False,,IP_7386868,False,female
ISIC_0984817,Memorial Sloan Kettering Cancer Center,CC-0,1,80,lower extremity,malignant,8.50,True,non-contact polarized,melanoma,histopathology,False,I,dermoscopic,IL_7629517,melanoma in situ,,,True,,IP_8090593,True,female
ISIC_0991761,Memorial Sloan Kettering Cancer Center,CC-0,1,65,upper extremity,benign,4.90,True,contact polarized,lentigo NOS,histopathology,False,II,dermoscopic,IL_1541362,,,,True,,IP_3891138,False,female
ISIC_1007406,Memorial Sloan Kettering Cancer Center,CC-0,1,55,lateral torso,benign,5.30,True,,nevus,histopathology,False,II,dermoscopic,IL_5428644,,,,True,,IP_0599018,True,male
ISIC_1017188,Memorial Sloan Kettering Cancer Center,CC-0,1049,80,posterior torso,benign,9.80,True,,lentigo NOS,histopathology,True,II,dermoscopic,IL_8742309,,,,True,,IP_0541183,False,female
ISIC_1019322,Memorial Sloan Kettering Cancer Center,CC-0,1,50,posterior torso,benign,5.70,True,,nevus,histopathology,False,II,dermoscopic,IL_0627663,,,,True,,IP_3128864,False,female
ISIC_1033970,Memorial Sloan Kettering Cancer Center,CC-0,1,40,posterior torso,benign,3.90,True,contact polarized,nevus,histopathology,True,II,dermoscopic,IL_6728443,,,,True,,IP_3700608,True,male
ISIC_1071362,Memorial Sloan Kettering Cancer Center,CC-0,1,45,posterior torso,benign,3.80,True,contact polarized,nevus,histopathology,True,II,dermoscopic,IL_9511996,,,,True,,IP_3919700,True,male
ISIC_1089722,Memorial Sloan Kettering Cancer Center,CC-0,1,40,lower extremity,benign,6.50,True,non-contact polarized,nevus,histopathology,True,II,dermoscopic,IL_8061363,,,,True,,IP_5641461,False,female
ISIC_1097830,Memorial Sloan Kettering Cancer Center,CC-0,1,65,anterior torso,benign,10.70,True,contact polarized,nevus,histopathology,False,I,dermoscopic,IL_4729256,,,,True,,IP_3619869,False,male
ISIC_1112228,Memorial Sloan Kettering Cancer Center,CC-0,1,65,upper extremity,benign,3.60,True,contact polarized,lentigo NOS,histopathology,False,III,dermoscopic,IL_4734846,,,,True,,IP_0385393,False,female
ISIC_1118807,Memorial Sloan Kettering Cancer Center,CC-0,1,75,lower extremity,benign,6.80,True,contact polarized,seborrheic keratosis,histopathology,False,III,dermoscopic,IL_6621771,,,,False,,IP_1726116,True,female
ISIC_1136731,Memorial Sloan Kettering Cancer Center,CC-0,124,70,lower extremity,benign,7.60,True,,actinic keratosis,histopathology,True,II,dermoscopic,IL_0036242,,,,True,,IP_7717848,True,female
ISIC_1147165,Memorial Sloan Kettering Cancer Center,CC-0,1,70,upper extremity,benign,6.00,True,,dermatofibroma,histopathology,False,I,dermoscopic,IL_7865798,,,,False,,IP_2768316,True,female
ISIC_1166740,Memorial Sloan Kettering Cancer Center,CC-0,1,75,posterior torso,indeterminate/malignant,8.60,True,,melanoma,histopathology,True,II,dermoscopic,IL_4895963,invasive melanoma,0.30,False,True,,IP_4171206,True,male
ISIC_1204130,Memorial Sloan Kettering Cancer Center,CC-0,1,40,lower extremity,benign,5.60,True,contact polarized,nevus,histopathology,False,II,dermoscopic,IL_8942894,,,,True,,IP_2071814,False,female
ISIC_1204654,Memorial Sloan Kettering Cancer Center,CC-0,1,85,posterior torso,benign,7.80,True,contact polarized,seborrheic keratosis,histopathology,True,II,dermoscopic,IL_8454359,,,,False,,IP_9090440,True,male
ISIC_1216542,Memorial Sloan Kettering Cancer Center,CC-0,1,30,posterior torso,benign,3.60,True,contact polarized,nevus,histopathology,True,III,dermoscopic,IL_3160951,,,,True,,IP_4993809,True,male
ISIC_1236175,Memorial Sloan Kettering Cancer Center,CC-0,1,20,anterior torso,benign,6.80,True,,nevus,histopathology,True,I,dermoscopic,IL_1354669,,,,True,,IP_4567115,True,female
ISIC_1244418,Memorial Sloan Kettering Cancer Center,CC-0,1,70,lower extremity,benign,3.70,True,contact polarized,dermatofibroma,histopathology,False,II,dermoscopic,IL_0135315,,,,False,,IP_6970316,False,female
ISIC_1254469,Memorial Sloan Kettering Cancer Center,CC-0,1,55,lower extremity,malignant,5.40,True,contact polarized,melanoma,histopathology,False,III,dermoscopic,IL_9545123,melanoma in situ,,,True,,IP_6270741,False,female
ISIC_1279356,Memorial Sloan Kettering Cancer Center,CC-0,1,75,lower extremity,benign,2.80,True,contact polarized,nevus,histopathology,False,II,dermoscopic,IL_9609940,,,,True,,IP_2711304,False,female
ISIC_1300267,Memorial Sloan Kettering Cancer Center,CC-0,1,65,posterior torso,benign,7.10,True,contact non-polarized,lichenoid keratosis,histopathology,False,III,dermoscopic,IL_9331682,,,,False,,IP_2712283,False,male
ISIC_1358080,Memorial Sloan Kettering Cancer Center,CC-0,1,55,lower extremity,benign,3.40,True,contact polarized,nevus,histopathology,False,I,dermoscopic,IL_1404959,,,,True,,IP_1400932,True,male
ISIC_1380829,Memorial Sloan Kettering Cancer Center,CC-0,1,40,upper extremity,benign,5.70,True,contact polarized,nevus,histopathology,True,III,dermoscopic,IL_5674392,,,,True,,IP_3068702,True,female
ISIC_1403411,Memorial Sloan Kettering Cancer Center,CC-0,1,35,upper extremity,benign,2.60,True,contact polarized,nevus,histopathology,True,III,dermoscopic,IL_6543676,,,,True,,IP_7331185,False,female
ISIC_1406434,Memorial Sloan Kettering Cancer Center,CC-0,1,70,posterior torso,benign,3.70,True,contact polarized,lichenoid keratosis,histopathology,True,II,dermoscopic,IL_9595538,,,,True,,IP_6200159,False,female
ISIC_1406593,Memorial Sloan Kettering Cancer Center,CC-0,1,75,posterior torso,benign,3.10,True,,nevus,histopathology,True,III,dermoscopic,IL_4893716,,,,True,,IP_6893721,False,female
ISIC_1418323,Memorial Sloan Kettering Cancer Center,CC-0,1,75,lower extremity,benign,5.20,True,contact polarized,seborrheic keratosis,histopathology,,III,dermoscopic,IL_2960154,,,,True,,IP_2829259,False,female
ISIC_1423737,Memorial Sloan Kettering Cancer Center,CC-0,1,75,posterior torso,malignant,9.20,True,contact polarized,melanoma,histopathology,False,II,dermoscopic,IL_8770408,melanoma in situ,,,True,,IP_9653634,True,male
ISIC_1467266,Memorial Sloan Kettering Cancer Center,CC-0,1,50,posterior torso,benign,3.90,True,contact polarized,nevus,histopathology,False,I,dermoscopic,IL_0928162,,,,True,,IP_3266584,True,male
ISIC_1474512,Memorial Sloan Kettering Cancer Center,CC-0,1,70,lower extremity,benign,2.20,True,contact non-polarized,nevus,histopathology,False,II,dermoscopic,IL_7052159,,,,True,,IP_4633465,True,male
ISIC_1498757,Memorial Sloan Kettering Cancer Center,CC-0,1,50,posterior torso,benign,9.70,True,contact polarized,nevus,histopathology,False,III,dermoscopic,IL_4859494,,,,True,,IP_9744773,True,male
ISIC_1536823,Memorial Sloan Kettering Cancer Center,CC-0,2864,65,lower extremity,benign,9.80,True,contact polarized,verruca,histopathology,True,II,dermoscopic,IL_4899739,,,,False,,IP_9067016,True,male
ISIC_1540369,Memorial Sloan Kettering Cancer Center,CC-0,1,25,upper extremity,benign,2.80,True,contact polarized,nevus,histopathology,True,II,dermoscopic,IL_7158723,,,,True,,IP_3158554,False,male
ISIC_1546866,Memorial Sloan Kettering Cancer Center,CC-0,1,65,posterior torso,benign,4.60,True,contact polarized,nevus,histopathology,False,III,dermoscopic,IL_3339854,,,,True,,IP_6988706,False,female
ISIC_1569258,Memorial Sloan Kettering Cancer Center,CC-0,1,65,posterior torso,benign,6.10,True,contact polarized,lentigo NOS,histopathology,True,II,dermoscopic,IL_0927947,,,,True,,IP_4732506,True,female
ISIC_1576116,Memorial Sloan Kettering Cancer Center,CC-0,1450,60,anterior torso,benign,6.80,True,non-contact polarized,nevus,histopathology,False,III,dermoscopic,IL_9905057,,,,True,,IP_7770500,True,male
ISIC_1578878,Memorial Sloan Kettering Cancer Center,CC-0,1,85,head/neck,malignant,10.20,True,contact polarized,melanoma,histopathology,False,III,dermoscopic,IL_2800343,melanoma in situ,,,True,,IP_5621209,True,male
ISIC_1579386,Memorial Sloan Kettering Cancer Center,CC-0,1,65,anterior torso,benign,19.70,True,contact polarized,seborrheic keratosis,histopathology,True,II,dermoscopic,IL_5923307,,,,True,,IP_0341102,False,female
ISIC_1581537,Memorial Sloan Kettering Cancer Center,CC-0,169,75,anterior torso,benign,4.10,True,contact polarized,nevus,histopathology,False,II,dermoscopic,IL_1737724,,,,True,,IP_5951155,True,male
ISIC_1617848,Memorial Sloan Kettering Cancer Center,CC-0,1,65,head/neck,benign,5.40,True,contact polarized,lentigo NOS,histopathology,True,II,dermoscopic,IL_7540024,,,,True,,IP_8219510,True,male
ISIC_1620821,Memorial Sloan Kettering Cancer Center,CC-0,1,45,posterior torso,benign,2.60,True,,nevus,histopathology,False,II,dermoscopic,IL_4746493,,,,True,,IP_5900484,True,female
ISIC_1626055,Memorial Sloan Kettering Cancer Center,CC-0,1,60,posterior torso,benign,6.00,True,contact polarized,nevus,histopathology,True,II,dermoscopic,IL_0601715,,,,True,,IP_4950891,False,female
ISIC_1635827,Memorial Sloan Kettering Cancer Center,CC-0,1,65,posterior torso,benign,4.00,True,contact polarized,nevus,histopathology,False,III,dermoscopic,IL_2320005,,,,True,,IP_3462372,False,female
ISIC_1652988,Memorial Sloan Kettering Cancer Center,CC-0,1,45,posterior torso,benign,3.60,True,contact polarized,nevus,histopathology,False,II,dermoscopic,IL_7291688,,,,True,,IP_5900484,True,female
ISIC_1693572,Memorial Sloan Kettering Cancer Center,CC-0,1,70,upper extremity,malignant,9.70,True,contact polarized,melanoma,histopathology,False,II,dermoscopic,IL_5444505,melanoma in situ,,,True,,IP_9741985,False,male
ISIC_1694817,Memorial Sloan Kettering Cancer Center,CC-0,1,30,lower extremity,malignant,4.50,True,non-contact polarized,melanoma,histopathology,False,II,dermoscopic,IL_4781357,invasive melanoma,0.20,False,True,,IP_2560383,False,male
ISIC_1699688,Memorial Sloan Kettering Cancer Center,CC-0,1,80,posterior torso,indeterminate/malignant,9.40,True,contact polarized,melanoma,histopathology,True,III,dermoscopic,IL_1654889,melanoma in situ,,,True,,IP_8166166,True,male
ISIC_1705827,Memorial Sloan Kettering Cancer Center,CC-0,1,55,upper extremity,benign,4.40,True,contact polarized,nevus,histopathology,False,III,dermoscopic,IL_3065578,,,,True,,IP_8674482,False,female
ISIC_1708591,Memorial Sloan Kettering Cancer Center,CC-0,1,55,lower extremity,malignant,5.40,True,non-contact polarized,squamous cell carcinoma,histopathology,False,II,dermoscopic,IL_2924810,,,,False,,IP_3492393,False,female
ISIC_1718882,Memorial Sloan Kettering Cancer Center,CC-0,1,40,upper extremity,benign,4.50,True,contact polarized,nevus,histopathology,True,IV,dermoscopic,IL_0329525,,,,True,,IP_2865917,False,male
ISIC_1736524,Memorial Sloan Kettering Cancer Center,CC-0,1,50,head/neck,benign,10.30,True,contact polarized,lentigo NOS,histopathology,False,II,dermoscopic,IL_7053045,,,,True,,IP_0748604,False,female
ISIC_1748491,Memorial Sloan Kettering Cancer Center,CC-0,1,60,lower extremity,benign,8.30,True,contact polarized,seborrheic keratosis,histopathology,False,II,dermoscopic,IL_3978832,,,,True,,IP_9534366,False,female
ISIC_1765228,Memorial Sloan Kettering Cancer Center,CC-0,1,60,anterior torso,benign,4.40,True,contact polarized,nevus,histopathology,False,III,dermoscopic,IL_8471027,,,,True,,IP_5737852,False,male
ISIC_1776777,Memorial Sloan Kettering Cancer Center,CC-0,1,80,lower extremity,malignant,7.80,True,,melanoma,histopathology,True,II,dermoscopic,IL_1696242,melanoma in situ,,,True,,IP_3813847,True,female
ISIC_1780008,Memorial Sloan Kettering Cancer Center,CC-0,1,75,anterior torso,malignant,6.40,True,contact polarized,squamous cell carcinoma,histopathology,False,III,dermoscopic,IL_5225844,,,,False,,IP_4901362,True,female
ISIC_1789103,Memorial Sloan Kettering Cancer Center,CC-0,198,80,upper extremity,benign,4.20,True,contact polarized,nevus,histopathology,False,III,dermoscopic,IL_7204597,,,,True,,IP_5789947,True,female