isic_id,attribution,copyright_license,benign_malignant,concomitant_biopsy,dermoscopic_type,diagnosis,diagnosis_confirm_type,image_type,lesion_id,mel_class,mel_thick_mm,mel_type,melanocytic
ISIC_0074059,"""Repeated dermoscopic images of melanocytic lesions"" by University Hospital Basel / CC-BY-NC",CC-BY-NC,benign,False,contact non-polarized,,serial imaging showing no change,dermoscopic,IL_4616340,,,,True
ISIC_0083619,"""Repeated dermoscopic images of melanocytic lesions"" by University Hospital Basel / CC-BY-NC",CC-BY-NC,benign,True,contact non-polarized,nevus,histopathology,dermoscopic,IL_1337099,,,,True
ISIC_0133200,"""Repeated dermoscopic images of melanocytic lesions"" by University Hospital Basel / CC-BY-NC",CC-BY-NC,malignant,True,contact non-polarized,melanoma,histopathology,dermoscopic,IL_4402356,melanoma in situ,,,True
ISIC_0137887,"""Repeated dermoscopic images of melanocytic lesions"" by University Hospital Basel / CC-BY-NC",CC-BY-NC,benign,False,contact non-polarized,,serial imaging showing no change,dermoscopic,IL_3573436,,,,True
ISIC_0138251,"""Repeated dermoscopic images of melanocytic lesions"" by University Hospital Basel / CC-BY-NC",CC-BY-NC,benign,False,contact non-polarized,,serial imaging showing no change,dermoscopic,IL_5383233,,,,True
ISIC_0149083,"""Repeated dermoscopic images of melanocytic lesions"" by University Hospital Basel / CC-BY-NC",CC-BY-NC,benign,False,contact non-polarized,,serial imaging showing no change,dermoscopic,IL_1777280,,,,True
ISIC_0162126,"""Repeated dermoscopic images of melanocytic lesions"" by University Hospital Basel / CC-BY-NC",CC-BY-NC,benign,False,contact non-polarized,,serial imaging showing no change,dermoscopic,IL_5216927,,,,True
ISIC_0176505,"""Repeated dermoscopic images of melanocytic lesions"" by University Hospital Basel / CC-BY-NC",CC-BY-NC,benign,False,contact non-polarized,,serial imaging showing no change,dermoscopic,IL_1693969,,,,True
ISIC_0191937,"""Repeated dermoscopic images of melanocytic lesions"" by University Hospital Basel / CC-BY-NC",CC-BY-NC,benign,True,contact non-polarized,nevus,histopathology,dermoscopic,IL_9804564,,,,True
ISIC_0217054,"""Repeated dermoscopic images of melanocytic lesions"" by University Hospital Basel / CC-BY-NC",CC-BY-NC,benign,False,contact non-polarized,,serial imaging showing no change,dermoscopic,IL_1922626,,,,True
ISIC_0239911,"""Repeated dermoscopic images of melanocytic lesions"" by University Hospital Basel / CC-BY-NC",CC-BY-NC,benign,False,contact non-polarized,,serial imaging showing no change,dermoscopic,IL_6256139,,,,True
ISIC_0257640,"""Repeated dermoscopic images of melanocytic lesions"" by University Hospital Basel / CC-BY-NC",CC-BY-NC,benign,True,contact non-polarized,nevus,histopathology,dermoscopic,IL_1907124,,,,True
ISIC_0279409,"""Repeated dermoscopic images of melanocytic lesions"" by University Hospital Basel / CC-BY-NC",CC-BY-NC,benign,True,contact non-polarized,nevus,histopathology,dermoscopic,IL_3580069,,,,True
ISIC_0293368,"""Repeated dermoscopic images of melanocytic lesions"" by University Hospital Basel / CC-BY-NC",CC-BY-NC,benign,False,contact non-polarized,,serial imaging showing no change,dermoscopic,IL_2681336,,,,True
ISIC_0293383,"""Repeated dermoscopic images of melanocytic lesions"" by University Hospital Basel / CC-BY-NC",CC-BY-NC,benign,False,contact non-polarized,,serial imaging showing no change,dermoscopic,IL_6256139,,,,True
ISIC_0294173,"""Repeated dermoscopic images of melanocytic lesions"" by University Hospital Basel / CC-BY-NC",CC-BY-NC,benign,False,contact non-polarized,,serial imaging showing no change,dermoscopic,IL_4821521,,,,True
ISIC_0330532,"""Repeated dermoscopic images of melanocytic lesions"" by University Hospital Basel / CC-BY-NC",CC-BY-NC,benign,False,contact non-polarized,,single image expert consensus,dermoscopic,IL_9634906,,,,True
ISIC_0337753,"""Repeated dermoscopic images of melanocytic lesions"" by University Hospital Basel / CC-BY-NC",CC-BY-NC,benign,True,contact non-polarized,nevus,histopathology,dermoscopic,IL_1790089,,,,True
ISIC_0399398,"""Repeated dermoscopic images of melanocytic lesions"" by University Hospital Basel / CC-BY-NC",CC-BY-NC,benign,False,contact non-polarized,,serial imaging showing no change,dermoscopic,IL_5653908,,,,True
ISIC_0446874,"""Repeated dermoscopic images of melanocytic lesions"" by University Hospital Basel / CC-BY-NC",CC-BY-NC,benign,True,contact non-polarized,nevus,histopathology,dermoscopic,IL_3221088,,,,True
ISIC_0462459,"""Repeated dermoscopic images of melanocytic lesions"" by University Hospital Basel / CC-BY-NC",CC-BY-NC,benign,False,contact non-polarized,,serial imaging showing no change,dermoscopic,IL_1922626,,,,True
ISIC_0524833,"""Repeated dermoscopic images of melanocytic lesions"" by University Hospital Basel / CC-BY-NC",CC-BY-NC,benign,False,contact non-polarized,,serial imaging showing no change,dermoscopic,IL_0331845,,,,True
ISIC_0541300,"""Repeated dermoscopic images of melanocytic lesions"" by University Hospital Basel / CC-BY-NC",CC-BY-NC,benign,True,contact non-polarized,nevus,histopathology,dermoscopic,IL_3652192,,,,True
ISIC_0547983,"""Repeated dermoscopic images of melanocytic lesions"" by University Hospital Basel / CC-BY-NC",CC-BY-NC,benign,True,contact non-polarized,nevus,histopathology,dermoscopic,IL_6734586,,,,True
ISIC_0562735,"""Repeated dermoscopic images of melanocytic lesions"" by University Hospital Basel / CC-BY-NC",CC-BY-NC,benign,False,contact non-polarized,,serial imaging showing no change,dermoscopic,IL_7408259,,,,True
ISIC_0582637,"""Repeated dermoscopic images of melanocytic lesions"" by University Hospital Basel / CC-BY-NC",CC-BY-NC,benign,True,contact non-polarized,nevus,histopathology,dermoscopic,IL_7123732,,,,True
ISIC_0582708,"""Repeated dermoscopic images of melanocytic lesions"" by University Hospital Basel / CC-BY-NC",CC-BY-NC,benign,False,contact non-polarized,,serial imaging showing no change,dermoscopic,IL_5835559,,,,True
ISIC_0603623,"""Repeated dermoscopic images of melanocytic lesions"" by University Hospital Basel / CC-BY-NC",CC-BY-NC,benign,True,contact non-polarized,nevus,histopathology,dermoscopic,IL_1907124,,,,True
ISIC_0613965,"""Repeated dermoscopic images of melanocytic lesions"" by University Hospital Basel / CC-BY-NC",CC-BY-NC,benign,False,contact non-polarized,,serial imaging showing no change,dermoscopic,IL_1480707,,,,True
ISIC_0661614,"""Repeated dermoscopic images of melanocytic lesions"" by University Hospital Basel / CC-BY-NC",CC-BY-NC,benign,True,contact non-polarized,nevus,histopathology,dermoscopic,IL_6450842,,,,True
ISIC_0674219,"""Repeated dermoscopic images of melanocytic lesions"" by University Hospital Basel / CC-BY-NC",CC-BY-NC,benign,False,contact non-polarized,,serial imaging showing no change,dermoscopic,IL_1178248,,,,True
ISIC_0708678,"""Repeated dermoscopic images of melanocytic lesions"" by University Hospital Basel / CC-BY-NC",CC-BY-NC,benign,False,contact non-polarized,,single image expert consensus,dermoscopic,IL_9634906,,,,True
ISIC_0713051,"""Repeated dermoscopic images of melanocytic lesions"" by University Hospital Basel / CC-BY-NC",CC-BY-NC,benign,True,contact non-polarized,nevus,histopathology,dermoscopic,IL_0791016,,,,True
ISIC_0724031,"""Repeated dermoscopic images of melanocytic lesions"" by University Hospital Basel / CC-BY-NC",CC-BY-NC,benign,True,contact non-polarized,nevus,histopathology,dermoscopic,IL_1160003,,,,True
ISIC_0757001,"""Repeated dermoscopic images of melanocytic lesions"" by University Hospital Basel / CC-BY-NC",CC-BY-NC,benign,False,contact non-polarized,,serial imaging showing no change,dermoscopic,IL_8722302,,,,True
ISIC_0779673,"""Repeated dermoscopic images of melanocytic lesions"" by University Hospital Basel / CC-BY-NC",CC-BY-NC,benign,False,contact non-polarized,,serial imaging showing no change,dermoscopic,IL_7118771,,,,True
ISIC_0796657,"""Repeated dermoscopic images of melanocytic lesions"" by University Hospital Basel / CC-BY-NC",CC-BY-NC,benign,False,contact non-polarized,,serial imaging showing no change,dermoscopic,IL_0398038,,,,True
ISIC_0803453,"""Repeated dermoscopic images of melanocytic lesions"" by University Hospital Basel / CC-BY-NC",CC-BY-NC,benign,False,contact non-polarized,,serial imaging showing no change,dermoscopic,IL_7155724,,,,True
ISIC_0811482,"""Repeated dermoscopic images of melanocytic lesions"" by University Hospital Basel / CC-BY-NC",CC-BY-NC,benign,False,contact non-polarized,,serial imaging showing no change,dermoscopic,IL_0283255,,,,True
ISIC_0824456,"""Repeated dermoscopic images of melanocytic lesions"" by University Hospital Basel / CC-BY-NC",CC-BY-NC,benign,True,contact non-polarized,nevus,histopathology,dermoscopic,IL_3580069,,,,True
ISIC_0855533,"""Repeated dermoscopic images of melanocytic lesions"" by University Hospital Basel / CC-BY-NC",CC-BY-NC,benign,True,contact non-polarized,nevus,histopathology,dermoscopic,IL_3223624,,,,True
ISIC_0876061,"""Repeated dermoscopic images of melanocytic lesions"" by University Hospital Basel / CC-BY-NC",CC-BY-NC,benign,True,contact non-polarized,nevus,histopathology,dermoscopic,IL_8091152,,,,True
ISIC_0896789,"""Repeated dermoscopic images of melanocytic lesions"" by University Hospital Basel / CC-BY-NC",CC-BY-NC,benign,True,contact non-polarized,nevus,histopathology,dermoscopic,IL_9804564,,,,True
ISIC_0903884,"""Repeated dermoscopic images of melanocytic lesions"" by University Hospital Basel / CC-BY-NC",CC-BY-NC,benign,True,contact non-polarized,nevus,histopathology,dermoscopic,IL_3580069,,,,True
ISIC_0925860,"""Repeated dermoscopic images of melanocytic lesions"" by University Hospital Basel / CC-BY-NC",CC-BY-NC,benign,False,contact non-polarized,,serial imaging showing no change,dermoscopic,IL_7155724,,,,True
ISIC_0953304,"""Repeated dermoscopic images of melanocytic lesions"" by University Hospital Basel / CC-BY-NC",CC-BY-NC,benign,True,contact non-polarized,nevus,histopathology,dermoscopic,IL_0844812,,,,True
ISIC_0956557,"""Repeated dermoscopic images of melanocytic lesions"" by University Hospital Basel / CC-BY-NC",CC-BY-NC,benign,False,contact non-polarized,,serial imaging showing no change,dermoscopic,IL_7408259,,,,True
ISIC_0998030,"""Repeated dermoscopic images of melanocytic lesions"" by University Hospital Basel / CC-BY-NC",CC-BY-NC,benign,False,contact non-polarized,,serial imaging showing no change,dermoscopic,IL_5216927,,,,True
ISIC_0999633,"""Repeated dermoscopic images of melanocytic lesions"" by University Hospital Basel / CC-BY-NC",CC-BY-NC,benign,True,contact non-polarized,nevus,histopathology,dermoscopic,IL_6901380,,,,True
ISIC_1009705,"""Repeated dermoscopic images of melanocytic lesions"" by University Hospital Basel / CC-BY-NC",CC-BY-NC,benign,False,contact non-polarized,,serial imaging showing no change,dermoscopic,IL_5544877,,,,True
ISIC_1020655,"""Repeated dermoscopic images of melanocytic lesions"" by University Hospital Basel / CC-BY-NC",CC-BY-NC,benign,False,contact non-polarized,,serial imaging showing no change,dermoscopic,IL_3227048,,,,True
ISIC_1025836,"""Repeated dermoscopic images of melanocytic lesions"" by University Hospital Basel / CC-BY-NC",CC-BY-NC,benign,True,contact non-polarized,nevus,histopathology,dermoscopic,IL_3580069,,,,True
ISIC_1037687,"""Repeated dermoscopic images of melanocytic lesions"" by University Hospital Basel / CC-BY-NC",CC-BY-NC,benign,False,contact non-polarized,,serial imaging showing no change,dermoscopic,IL_2525264,,,,True
ISIC_1038112,"""Repeated dermoscopic images of melanocytic lesions"" by University Hospital Basel / CC-BY-NC",CC-BY-NC,benign,False,contact non-polarized,,serial imaging showing no change,dermoscopic,IL_9702876,,,,True
ISIC_1039734,"""Repeated dermoscopic images of melanocytic lesions"" by University Hospital Basel / CC-BY-NC",CC-BY-NC,benign,False,contact non-polarized,,serial imaging showing no change,dermoscopic,IL_1777280,,,,True
ISIC_1044305,"""Repeated dermoscopic images of melanocytic lesions"" by University Hospital Basel / CC-BY-NC",CC-BY-NC,benign,False,contact non-polarized,,serial imaging showing no change,dermoscopic,IL_1768500,,,,True
ISIC_1055577,"""Repeated dermoscopic images of melanocytic lesions"" by University Hospital Basel / CC-BY-NC",CC-BY-NC,benign,True,contact non-polarized,nevus,histopathology,dermoscopic,IL_0308270,,,,True
ISIC_1055578,"""Repeated dermoscopic images of melanocytic lesions"" by University Hospital Basel / CC-BY-NC",CC-BY-NC,benign,True,contact non-polarized,nevus,histopathology,dermoscopic,IL_8235872,,,,True
ISIC_1063191,"""Repeated dermoscopic images of melanocytic lesions"" by University Hospital Basel / CC-BY-NC",CC-BY-NC,benign,False,contact non-polarized,,serial imaging showing no change,dermoscopic,IL_5458224,,,,True
ISIC_1076045,"""Repeated dermoscopic images of melanocytic lesions"" by University Hospital Basel / CC-BY-NC",CC-BY-NC,benign,True,contact non-polarized,nevus,histopathology,dermoscopic,IL_0329653,,,,True
ISIC_1102185,"""Repeated dermoscopic images of melanocytic lesions"" by University Hospital Basel / CC-BY-NC",CC-BY-NC,benign,False,contact non-polarized,,serial imaging showing no change,dermoscopic,IL_9183952,,,,True
ISIC_1109538,"""Repeated dermoscopic images of melanocytic lesions"" by University Hospital Basel / CC-BY-NC",CC-BY-NC,benign,False,contact non-polarized,,serial imaging showing no change,dermoscopic,IL_7807918,,,,True
ISIC_1113040,"""Repeated dermoscopic images of melanocytic lesions"" by University Hospital Basel / CC-BY-NC",CC-BY-NC,benign,True,contact non-polarized,nevus,histopathology,dermoscopic,IL_0835064,,,,True
ISIC_1120622,"""Repeated dermoscopic images of melanocytic lesions"" by University Hospital Basel / CC-BY-NC",CC-BY-NC,benign,False,contact non-polarized,,serial imaging showing no change,dermoscopic,IL_7586642,,,,True
ISIC_1144433,"""Repeated dermoscopic images of melanocytic lesions"" by University Hospital Basel / CC-BY-NC",CC-BY-NC,benign,False,contact non-polarized,,single image expert consensus,dermoscopic,IL_9634906,,,,True
ISIC_1176144,"""Repeated dermoscopic images of melanocytic lesions"" by University Hospital Basel / CC-BY-NC",CC-BY-NC,benign,False,contact non-polarized,,serial imaging showing no change,dermoscopic,IL_8146023,,,,True
ISIC_1186554,"""Repeated dermoscopic images of melanocytic lesions"" by University Hospital Basel / CC-BY-NC",CC-BY-NC,benign,False,contact non-polarized,,serial imaging showing no change,dermoscopic,IL_5383233,,,,True
ISIC_1192092,"""Repeated dermoscopic images of melanocytic lesions"" by University Hospital Basel / CC-BY-NC",CC-BY-NC,benign,False,contact non-polarized,,serial imaging showing no change,dermoscopic,IL_1768500,,,,True
ISIC_1202054,"""Repeated dermoscopic images of melanocytic lesions"" by University Hospital Basel / CC-BY-NC",CC-BY-NC,benign,False,contact non-polarized,,serial imaging showing no change,dermoscopic,IL_7209388,,,,True
ISIC_1217907,"""Repeated dermoscopic images of melanocytic lesions"" by University Hospital Basel / CC-BY-NC",CC-BY-NC,benign,False,contact non-polarized,,serial imaging showing no change,dermoscopic,IL_7155724,,,,True
ISIC_1224978,"""Repeated dermoscopic images of melanocytic lesions"" by University Hospital Basel / CC-BY-NC",CC-BY-NC,benign,True,contact non-polarized,nevus,histopathology,dermoscopic,IL_1977562,,,,True
ISIC_1226823,"""Repeated dermoscopic images of melanocytic lesions"" by University Hospital Basel / CC-BY-NC",CC-BY-NC,benign,True,contact non-polarized,nevus,histopathology,dermoscopic,IL_7183625,,,,True
ISIC_1242298,"""Repeated dermoscopic images of melanocytic lesions"" by University Hospital Basel / CC-BY-NC",CC-BY-NC,benign,False,contact non-polarized,,serial imaging showing no change,dermoscopic,IL_7503860,,,,True
ISIC_1245241,"""Repeated dermoscopic images of melanocytic lesions"" by University Hospital Basel / CC-BY-NC",CC-BY-NC,benign,False,contact non-polarized,,serial imaging showing no change,dermoscopic,IL_7212000,,,,True
ISIC_1255817,"""Repeated dermoscopic images of melanocytic lesions"" by University Hospital Basel / CC-BY-NC",CC-BY-NC,benign,True,contact non-polarized,nevus,histopathology,dermoscopic,IL_5299431,,,,True
ISIC_1258837,"""Repeated dermoscopic images of melanocytic lesions"" by University Hospital Basel / CC-BY-NC",CC-BY-NC,benign,True,contact non-polarized,nevus,histopathology,dermoscopic,IL_9734933,,,,True
ISIC_1289378,"""Repeated dermoscopic images of melanocytic lesions"" by University Hospital Basel / CC-BY-NC",CC-BY-NC,benign,False,contact non-polarized,,serial imaging showing no change,dermoscopic,IL_3948122,,,,True
ISIC_1305756,"""Repeated dermoscopic images of melanocytic lesions"" by University Hospital Basel / CC-BY-NC",CC-BY-NC,benign,True,contact non-polarized,nevus,histopathology,dermoscopic,IL_3352253,,,,True
ISIC_1309320,"""Repeated dermoscopic images of melanocytic lesions"" by University Hospital Basel / CC-BY-NC",CC-BY-NC,malignant,False,contact non-polarized,,single image expert consensus,dermoscopic,IL_1351938,,,,True
ISIC_1310382,"""Repeated dermoscopic images of melanocytic lesions"" by University Hospital Basel / CC-BY-NC",CC-BY-NC,benign,False,contact non-polarized,,serial imaging showing no change,dermoscopic,IL_8278691,,,,True
ISIC_1369619,"""Repeated dermoscopic images of melanocytic lesions"" by University Hospital Basel / CC-BY-NC",CC-BY-NC,benign,False,contact non-polarized,,serial imaging showing no change,dermoscopic,IL_1178248,,,,True
ISIC_1374285,"""Repeated dermoscopic images of melanocytic lesions"" by University Hospital Basel / CC-BY-NC",CC-BY-NC,benign,True,contact non-polarized,nevus,histopathology,dermoscopic,IL_0252459,,,,True
ISIC_1379344,"""Repeated dermoscopic images of melanocytic lesions"" by University Hospital Basel / CC-BY-NC",CC-BY-NC,benign,True,contact non-polarized,nevus,histopathology,dermoscopic,IL_4118032,,,,True
ISIC_1389789,"""Repeated dermoscopic images of melanocytic lesions"" by University Hospital Basel / CC-BY-NC",CC-BY-NC,benign,False,contact non-polarized,,serial imaging showing no change,dermoscopic,IL_1777280,,,,True
ISIC_1403904,"""Repeated dermoscopic images of melanocytic lesions"" by University Hospital Basel / CC-BY-NC",CC-BY-NC,benign,False,contact non-polarized,,single image expert consensus,dermoscopic,IL_5845085,,,,True
ISIC_1418956,"""Repeated dermoscopic images of melanocytic lesions"" by University Hospital Basel / CC-BY-NC",CC-BY-NC,benign,True,contact non-polarized,nevus,histopathology,dermoscopic,IL_1337099,,,,True
ISIC_1429148,"""Repeated dermoscopic images of melanocytic lesions"" by University Hospital Basel / CC-BY-NC",CC-BY-NC,benign,True,contact non-polarized,nevus,histopathology,dermoscopic,IL_0791016,,,,True
ISIC_1434299,"""Repeated dermoscopic images of melanocytic lesions"" by University Hospital Basel / CC-BY-NC",CC-BY-NC,benign,True,contact non-polarized,nevus,histopathology,dermoscopic,IL_6901380,,,,True
ISIC_1435135,"""Repeated dermoscopic images of melanocytic lesions"" by University Hospital Basel / CC-BY-NC",CC-BY-NC,malignant,True,contact non-polarized,melanoma,histopathology,dermoscopic,IL_4402356,melanoma in situ,,,True
ISIC_1435489,"""Repeated dermoscopic images of melanocytic lesions"" by University Hospital Basel / CC-BY-NC",CC-BY-NC,benign,True,contact non-polarized,nevus,histopathology,dermoscopic,IL_9623006,,,,True
ISIC_1462703,"""Repeated dermoscopic images of melanocytic lesions"" by University Hospital Basel / CC-BY-NC",CC-BY-NC,benign,True,contact non-polarized,nevus,histopathology,dermoscopic,IL_9240192,,,,True
ISIC_1470864,"""Repeated dermoscopic images of melanocytic lesions"" by University Hospital Basel / CC-BY-NC",CC-BY-NC,benign,False,contact non-polarized,,serial imaging showing no change,dermoscopic,IL_4515873,,,,True
ISIC_1491606,"""Repeated dermoscopic images of melanocytic lesions"" by University Hospital Basel / CC-BY-NC",CC-BY-NC,benign,False,contact non-polarized,,serial imaging showing no change,dermoscopic,IL_4346256,,,,True
ISIC_1505481,"""Repeated dermoscopic images of melanocytic lesions"" by University Hospital Basel / CC-BY-NC",CC-BY-NC,benign,True,contact non-polarized,nevus,histopathology,dermoscopic,IL_7806574,,,,True
ISIC_1506953,"""Repeated dermoscopic images of melanocytic lesions"" by University Hospital Basel / CC-BY-NC",CC-BY-NC,benign,True,contact non-polarized,solar lentigo,histopathology,dermoscopic,IL_6078690,,,,True
ISIC_1527176,"""Repeated dermoscopic images of melanocytic lesions"" by University Hospital Basel / CC-BY-NC",CC-BY-NC,benign,True,contact non-polarized,nevus,histopathology,dermoscopic,IL_4118032,,,,True
ISIC_1530817,"""Repeated dermoscopic images of melanocytic lesions"" by University Hospital Basel / CC-BY-NC",CC-BY-NC,benign,False,contact non-polarized,,serial imaging showing no change,dermoscopic,IL_2866020,,,,True
ISIC_1533064,"""Repeated dermoscopic images of melanocytic lesions"" by University Hospital Basel / CC-BY-NC",CC-BY-NC,benign,False,contact non-polarized,,serial imaging showing no change,dermoscopic,IL_9702876,,,,True
ISIC_1533657,"""Repeated dermoscopic images of melanocytic lesions"" by University Hospital Basel / CC-BY-NC",CC-BY-NC,benign,False,contact non-polarized,,serial imaging showing no change,dermoscopic,IL_8146023,,,,True
ISIC_1535954,"""Repeated dermoscopic images of melanocytic lesions"" by University Hospital Basel / CC-BY-NC",CC-BY-NC,benign,False,contact non-polarized,,serial imaging showing no change,dermoscopic,IL_1909022,,,,True
ISIC_1540340,"""Repeated dermoscopic images of melanocytic lesions"" by University Hospital Basel / CC-BY-NC",CC-BY-NC,benign,False,contact non-polarized,,serial imaging showing no change,dermoscopic,IL_2681336,,,,True
ISIC_1544261,"""Repeated dermoscopic images of melanocytic lesions"" by University Hospital Basel / CC-BY-NC",CC-BY-NC,benign,False,contact non-polarized,,serial imaging showing no change,dermoscopic,IL_8205974,,,,True
ISIC_1548463,"""Repeated dermoscopic images of melanocytic lesions"" by University Hospital Basel / CC-BY-NC",CC-BY-NC,benign,True,contact non-polarized,nevus,histopathology,dermoscopic,IL_4118032,,,,True
ISIC_1548813,"""Repeated dermoscopic images of melanocytic lesions"" by University Hospital Basel / CC-BY-NC",CC-BY-NC,benign,False,contact non-polarized,,serial imaging showing no change,dermoscopic,IL_6515342,,,,True
ISIC_1563835,"""Repeated dermoscopic images of melanocytic lesions"" by University Hospital Basel / CC-BY-NC",CC-BY-NC,malignant,False,contact non-polarized,,single image expert consensus,dermoscopic,IL_1351938,,,,True
ISIC_1572603,"""Repeated dermoscopic images of melanocytic lesions"" by University Hospital Basel / CC-BY-NC",CC-BY-NC,benign,False,contact non-polarized,,serial imaging showing no change,dermoscopic,IL_3573436,,,,True
ISIC_1575578,"""Repeated dermoscopic images of melanocytic lesions"" by University Hospital Basel / CC-BY-NC",CC-BY-NC,benign,False,contact non-polarized,,serial imaging showing no change,dermoscopic,IL_1909022,,,,True
ISIC_1581300,"""Repeated dermoscopic images of melanocytic lesions"" by University Hospital Basel / CC-BY-NC",CC-BY-NC,benign,True,contact non-polarized,nevus,histopathology,dermoscopic,IL_9804564,,,,True
ISIC_1588655,"""Repeated dermoscopic images of melanocytic lesions"" by University Hospital Basel / CC-BY-NC",CC-BY-NC,benign,False,contact non-polarized,,serial imaging showing no change,dermoscopic,IL_0398038,,,,True
ISIC_1596131,"""Repeated dermoscopic images of melanocytic lesions"" by University Hospital Basel / CC-BY-NC",CC-BY-NC,benign,False,contact non-polarized,,serial imaging showing no change,dermoscopic,IL_7056100,,,,True