isic_id,attribution,copyright_license,acquisition_day,age_approx,anatom_site_general,benign_malignant,clin_size_long_diam_mm,concomitant_biopsy,dermoscopic_type,diagnosis,diagnosis_confirm_type,family_hx_mm,fitzpatrick_skin_type,image_type,lesion_id,mel_class,mel_thick_mm,mel_ulcer,melanocytic,patient_id,personal_hx_mm,sex
ISIC_0085644,Memorial Sloan Kettering Cancer Center,CC-BY,2020,50,lower extremity,benign,3.90,,contact non-polarized,nevus,histopathology,True,I,dermoscopic,IL_2775050,,,,True,IP_3227071,True,female
ISIC_0139381,Memorial Sloan Kettering Cancer Center,CC-BY,501,30,anterior torso,benign,,,non-contact polarized,,,True,II,dermoscopic,IL_5279585,,,,True,IP_6802244,False,female
ISIC_0168811,Memorial Sloan Kettering Cancer Center,CC-BY,1121,80,anterior torso,malignant,10.10,,,melanoma,histopathology,False,II,clinical: close-up,IL_4657752,,,,True,IP_2597637,True,male
ISIC_0248915,Memorial Sloan Kettering Cancer Center,CC-BY,1835,65,lower extremity,indeterminate/malignant,,,,scar,single image expert consensus,True,II,clinical: close-up,IL_4668218,,,,True,IP_2763321,True,female
ISIC_0260516,Memorial Sloan Kettering Cancer Center,CC-BY,106,35,anterior torso,benign,,,,,,True,II,clinical: close-up,IL_8547824,,,,True,IP_7407753,,female
ISIC_0272026,Memorial Sloan Kettering Cancer Center,CC-BY-NC,84,25,upper extremity,benign,,False,,,single image expert consensus,,,dermoscopic,IL_2903373,,,,,IP_4938382,,female
ISIC_0296251,Memorial Sloan Kettering Cancer Center,CC-BY,1524,55,posterior torso,benign,,,non-contact polarized,,,False,IV,dermoscopic,IL_6156202,,,,True,IP_0892965,False,male
ISIC_0378777,Memorial Sloan Kettering Cancer Center,CC-BY,78,80,anterior torso,benign,,,contact polarized,,,False,II,dermoscopic,IL_4657752,,,,True,IP_2597637,,male
ISIC_0438180,Memorial Sloan Kettering Cancer Center,CC-BY,84,25,upper extremity,benign,,,,,,True,II,clinical: close-up,IL_9094477,,,,True,IP_4003333,,female
ISIC_0469776,Memorial Sloan Kettering Cancer Center,CC-BY,2020,50,lower extremity,benign,3.90,,non-contact polarized,nevus,histopathology,True,I,dermoscopic,IL_2775050,,,,True,IP_3227071,True,female
ISIC_0485014,Memorial Sloan Kettering Cancer Center,CC-BY,1,45,lower extremity,benign,,,contact non-polarized,,,True,I,dermoscopic,IL_2775050,,,,True,IP_3227071,,female
ISIC_0485881,Memorial Sloan Kettering Cancer Center,CC-BY-NC,78,80,anterior torso,benign,,False,,,single image expert consensus,,,dermoscopic,IL_2070313,,,,,IP_1999627,,male
ISIC_0509436,Memorial Sloan Kettering Cancer Center,CC-BY,2887,60,posterior torso,benign,5.30,,contact non-polarized,nevus,histopathology,False,IV,dermoscopic,IL_6156202,,,,True,IP_0892965,False,male
ISIC_0705204,Memorial Sloan Kettering Cancer Center,CC-BY,1464,50,anterior torso,benign,,,non-contact polarized,,,True,IV,dermoscopic,IL_2668505,,,,True,IP_1238256,,female
ISIC_0734335,Memorial Sloan Kettering Cancer Center,CC-BY,78,80,lower extremity,benign,,,,,,False,II,clinical: close-up,IL_1962864,,,,True,IP_2597637,,male
ISIC_0788010,Memorial Sloan Kettering Cancer Center,CC-BY,1736,30,lower extremity,benign,6.60,,,nevus,histopathology,True,II,clinical: close-up,IL_2480900,,,,True,IP_4003333,True,female
ISIC_0848012,Memorial Sloan Kettering Cancer Center,CC-0,2497,55,anterior torso,benign,6.60,True,contact polarized,nevus,histopathology,True,IV,dermoscopic,IL_3480492,,,,True,IP_9563768,True,female
ISIC_0851414,Memorial Sloan Kettering Cancer Center,CC-BY,1639,65,lower extremity,indeterminate/malignant,8.70,,non-contact polarized,melanoma,histopathology,True,II,dermoscopic,IL_4668218,,,,True,IP_2763321,True,female
ISIC_0883681,Memorial Sloan Kettering Cancer Center,CC-BY-NC,743,60,lateral torso,benign,,False,,,single image expert consensus,,,dermoscopic,IL_7958441,,,,,IP_9067016,,male
ISIC_0977979,Memorial Sloan Kettering Cancer Center,CC-BY,1736,30,lower extremity,benign,6.60,,contact non-polarized,nevus,histopathology,True,II,dermoscopic,IL_2480900,,,,True,IP_4003333,True,female
ISIC_1028529,Memorial Sloan Kettering Cancer Center,CC-BY,2864,65,lateral torso,indeterminate/benign,,,contact non-polarized,atypical melanocytic proliferation,histopathology,True,IV,dermoscopic,IL_2548767,,,,True,IP_4901886,,male
ISIC_1136887,Memorial Sloan Kettering Cancer Center,CC-BY,1688,55,anterior torso,benign,,,non-contact polarized,,,True,IV,dermoscopic,IL_2668505,,,,True,IP_1238256,,female
ISIC_1190966,Memorial Sloan Kettering Cancer Center,CC-BY,501,30,anterior torso,benign,,,contact non-polarized,,,True,II,dermoscopic,IL_5279585,,,,True,IP_6802244,False,female
ISIC_1633321,Memorial Sloan Kettering Cancer Center,CC-BY,1121,80,anterior torso,malignant,10.10,,contact non-polarized,melanoma,histopathology,False,II,dermoscopic,IL_4657752,,,,True,IP_2597637,True,male
ISIC_1648650,Memorial Sloan Kettering Cancer Center,CC-BY,2360,40,lateral torso,benign,4.20,,non-contact polarized,nevus,histopathology,True,II,dermoscopic,IL_8547824,,,,True,IP_7407753,True,female
ISIC_1871423,Memorial Sloan Kettering Cancer Center,CC-BY,1,45,lower extremity,benign,,,contact polarized,,,True,I,dermoscopic,IL_2775050,,,,True,IP_3227071,,female
ISIC_1933651,Memorial Sloan Kettering Cancer Center,CC-BY,1,45,lower extremity,benign,,,,,,True,I,clinical: close-up,IL_2775050,,,,True,IP_3227071,,female
ISIC_1951839,Memorial Sloan Kettering Cancer Center,CC-0,2360,40,lateral torso,benign,4.20,True,contact polarized,nevus,histopathology,True,II,dermoscopic,IL_2591697,,,,True,IP_4173362,True,female
ISIC_2222766,Memorial Sloan Kettering Cancer Center,CC-BY,1233,80,lower extremity,malignant,10.40,,,melanoma,histopathology,False,II,clinical: close-up,IL_1962864,,,,True,IP_2597637,True,male
ISIC_2280374,Memorial Sloan Kettering Cancer Center,CC-BY,2020,50,lower extremity,benign,3.90,,,nevus,histopathology,True,I,clinical: close-up,IL_2775050,,,,True,IP_3227071,True,female
ISIC_2407661,Memorial Sloan Kettering Cancer Center,CC-BY,1688,55,anterior torso,benign,,,contact non-polarized,,,True,IV,dermoscopic,IL_2668505,,,,True,IP_1238256,,female
ISIC_2486464,Memorial Sloan Kettering Cancer Center,CC-BY,2068,30,anterior torso,benign,2.50,,,nevus,histopathology,True,II,clinical: close-up,IL_5279585,,,,True,IP_6802244,False,female
ISIC_2588440,Memorial Sloan Kettering Cancer Center,CC-BY,2068,30,anterior torso,benign,2.50,,contact non-polarized,nevus,histopathology,True,II,dermoscopic,IL_5279585,,,,True,IP_6802244,False,female
ISIC_2691236,Memorial Sloan Kettering Cancer Center,CC-BY,1736,30,lower extremity,benign,6.60,,non-contact polarized,nevus,histopathology,True,II,dermoscopic,IL_2480900,,,,True,IP_4003333,True,female
ISIC_2719795,Memorial Sloan Kettering Cancer Center,CC-BY,2287,55,anterior torso,benign,,,contact polarized,,,True,IV,dermoscopic,IL_2668505,,,,True,IP_1238256,,female
ISIC_2785419,Memorial Sloan Kettering Cancer Center,CC-BY,171,65,lower extremity,benign,,,non-contact polarized,,,True,II,dermoscopic,IL_4668218,,,,True,IP_2763321,,female
ISIC_2792717,Memorial Sloan Kettering Cancer Center,CC-BY,1121,80,anterior torso,malignant,10.10,,contact polarized,melanoma,histopathology,False,II,dermoscopic,IL_4657752,,,,True,IP_2597637,True,male
ISIC_2989732,Memorial Sloan Kettering Cancer Center,CC-BY,78,80,anterior torso,benign,,,non-contact polarized,,,False,II,dermoscopic,IL_4657752,,,,True,IP_2597637,,male
ISIC_3138836,Memorial Sloan Kettering Cancer Center,CC-BY-NC,171,65,lower extremity,benign,,False,,,single image expert consensus,,,dermoscopic,IL_7149631,,,,,IP_1885773,,female
ISIC_3261921,Memorial Sloan Kettering Cancer Center,CC-BY,1736,30,lower extremity,benign,6.60,,,nevus,histopathology,True,II,clinical: close-up,IL_2480900,,,,True,IP_4003333,True,female
ISIC_3371433,Memorial Sloan Kettering Cancer Center,CC-BY,1736,30,lower extremity,benign,6.60,,non-contact polarized,nevus,histopathology,True,II,dermoscopic,IL_2480900,,,,True,IP_4003333,True,female
ISIC_3640885,Memorial Sloan Kettering Cancer Center,CC-BY,501,30,anterior torso,benign,,,,,,True,II,clinical: close-up,IL_5279585,,,,True,IP_6802244,False,female
ISIC_3747716,Memorial Sloan Kettering Cancer Center,CC-BY,1688,55,anterior torso,benign,,,,,,True,IV,clinical: close-up,IL_2668505,,,,True,IP_1238256,,female
ISIC_3831079,Memorial Sloan Kettering Cancer Center,CC-BY,2497,55,anterior torso,benign,6.60,,non-contact polarized,nevus,histopathology,True,IV,dermoscopic,IL_2668505,,,,True,IP_1238256,True,female
ISIC_3855124,Memorial Sloan Kettering Cancer Center,CC-BY,1464,50,anterior torso,benign,,,contact non-polarized,,,True,IV,dermoscopic,IL_2668505,,,,True,IP_1238256,,female
ISIC_4049598,Memorial Sloan Kettering Cancer Center,CC-BY-NC,78,80,lower extremity,benign,,False,,,single image expert consensus,,,dermoscopic,IL_8558961,,,,,IP_1999627,,male
ISIC_4165214,Memorial Sloan Kettering Cancer Center,CC-BY-NC,106,35,anterior torso,benign,,False,,,single image expert consensus,,,dermoscopic,IL_2591697,,,,,IP_4173362,,female
ISIC_4647348,Memorial Sloan Kettering Cancer Center,CC-BY,84,25,lower extremity,benign,,,,,,True,II,clinical: close-up,IL_2480900,,,,True,IP_4003333,,female
ISIC_4676795,Memorial Sloan Kettering Cancer Center,CC-BY,2360,40,lateral torso,benign,4.20,,,nevus,histopathology,True,II,clinical: close-up,IL_8547824,,,,True,IP_7407753,True,female
ISIC_4691636,Memorial Sloan Kettering Cancer Center,CC-BY,1524,55,posterior torso,benign,,,,,,False,IV,clinical: close-up,IL_6156202,,,,True,IP_0892965,False,male
ISIC_4698636,Memorial Sloan Kettering Cancer Center,CC-BY,743,60,lateral torso,benign,,,contact non-polarized,,,True,IV,dermoscopic,IL_2548767,,,,True,IP_4901886,,male
ISIC_4701228,Memorial Sloan Kettering Cancer Center,CC-BY,84,25,lower extremity,benign,,,non-contact polarized,,,True,II,dermoscopic,IL_2480900,,,,True,IP_4003333,,female
ISIC_4702538,Memorial Sloan Kettering Cancer Center,CC-BY,78,80,anterior torso,benign,,,,,,False,II,clinical: close-up,IL_4657752,,,,True,IP_2597637,,male
ISIC_4747370,Memorial Sloan Kettering Cancer Center,CC-BY,1835,65,lower extremity,indeterminate/malignant,,,,scar,single image expert consensus,True,II,clinical: close-up,IL_4668218,,,,True,IP_2763321,True,female
ISIC_4895388,Memorial Sloan Kettering Cancer Center,CC-BY,106,35,anterior torso,benign,,,non-contact polarized,,,True,II,dermoscopic,IL_8547824,,,,True,IP_7407753,,female
ISIC_4957036,Memorial Sloan Kettering Cancer Center,CC-BY,2864,65,lateral torso,indeterminate/benign,,,non-contact polarized,atypical melanocytic proliferation,histopathology,True,IV,dermoscopic,IL_2548767,,,,True,IP_4901886,,male
ISIC_5009385,Memorial Sloan Kettering Cancer Center,CC-BY,2020,50,lower extremity,benign,3.90,,,nevus,histopathology,True,I,clinical: close-up,IL_2775050,,,,True,IP_3227071,True,female
ISIC_5054247,Memorial Sloan Kettering Cancer Center,CC-BY,1639,65,lower extremity,indeterminate/malignant,8.70,,,melanoma,histopathology,True,II,clinical: close-up,IL_4668218,,,,True,IP_2763321,True,female
ISIC_5088064,Memorial Sloan Kettering Cancer Center,CC-BY,1736,30,lower extremity,benign,6.60,,non-contact polarized,nevus,histopathology,True,II,dermoscopic,IL_2480900,,,,True,IP_4003333,True,female
ISIC_5117966,Memorial Sloan Kettering Cancer Center,CC-BY,430,55,posterior torso,benign,,,non-contact polarized,,,False,IV,dermoscopic,IL_6156202,,,,True,IP_0892965,False,male
ISIC_5147305,Memorial Sloan Kettering Cancer Center,CC-BY,1835,65,lower extremity,indeterminate/malignant,,,non-contact polarized,scar,single image expert consensus,True,II,dermoscopic,IL_4668218,,,,True,IP_2763321,True,female
ISIC_5230672,Memorial Sloan Kettering Cancer Center,CC-BY,1835,65,lower extremity,indeterminate/malignant,,,contact polarized,scar,single image expert consensus,True,II,dermoscopic,IL_4668218,,,,True,IP_2763321,True,female
ISIC_5257439,Memorial Sloan Kettering Cancer Center,CC-BY,2360,40,lateral torso,benign,4.20,,,nevus,histopathology,True,II,clinical: close-up,IL_8547824,,,,True,IP_7407753,True,female
ISIC_5549257,Memorial Sloan Kettering Cancer Center,CC-0,2068,30,lower extremity,benign,2.50,True,contact polarized,nevus,histopathology,True,II,dermoscopic,IL_5463461,,,,True,IP_6098503,False,female
ISIC_5574004,Memorial Sloan Kettering Cancer Center,CC-BY,2497,55,anterior torso,benign,6.60,,,nevus,histopathology,True,IV,clinical: close-up,IL_2668505,,,,True,IP_1238256,True,female
ISIC_5638210,Memorial Sloan Kettering Cancer Center,CC-BY,78,80,anterior torso,benign,,,contact non-polarized,,,False,II,dermoscopic,IL_4657752,,,,True,IP_2597637,,male
ISIC_5723495,Memorial Sloan Kettering Cancer Center,CC-BY-NC,501,30,anterior torso,benign,,False,,,single image expert consensus,,,dermoscopic,IL_5463461,,,,,IP_6098503,,female
ISIC_5921373,Memorial Sloan Kettering Cancer Center,CC-BY,1464,50,anterior torso,benign,,,,,,True,IV,clinical: close-up,IL_2668505,,,,True,IP_1238256,,female
ISIC_6004197,Memorial Sloan Kettering Cancer Center,CC-0,1233,80,lower extremity,malignant,10.40,True,non-contact polarized,melanoma,histopathology,False,II,dermoscopic,IL_8558961,melanoma in situ,,,True,IP_1999627,True,male
ISIC_6141677,Memorial Sloan Kettering Cancer Center,CC-BY,171,65,lower extremity,benign,,,,,,True,II,clinical: close-up,IL_4668218,,,,True,IP_2763321,,female
ISIC_6202682,Memorial Sloan Kettering Cancer Center,CC-BY,1736,30,lower extremity,benign,6.60,,non-contact polarized,nevus,histopathology,True,II,dermoscopic,IL_2480900,,,,True,IP_4003333,True,female
ISIC_6364782,Memorial Sloan Kettering Cancer Center,CC-BY,1233,80,lower extremity,malignant,10.40,,contact polarized,melanoma,histopathology,False,II,dermoscopic,IL_1962864,,,,True,IP_2597637,True,male
ISIC_6414435,Memorial Sloan Kettering Cancer Center,CC-0,1736,30,lower extremity,benign,6.60,True,contact polarized,nevus,histopathology,True,II,dermoscopic,IL_7567811,,,,True,IP_4938382,True,female
ISIC_6453281,Memorial Sloan Kettering Cancer Center,CC-BY,171,65,lower extremity,benign,,,contact non-polarized,,,True,II,dermoscopic,IL_4668218,,,,True,IP_2763321,,female
ISIC_6587301,Memorial Sloan Kettering Cancer Center,CC-BY,317,45,lower extremity,benign,,,,,,True,I,clinical: close-up,IL_2775050,,,,True,IP_3227071,,female
ISIC_6595273,Memorial Sloan Kettering Cancer Center,CC-BY-NC,317,45,lower extremity,benign,,False,,,single image expert consensus,,,dermoscopic,IL_2141559,,,,,IP_0777867,,female
ISIC_6683697,Memorial Sloan Kettering Cancer Center,CC-BY,1639,65,lower extremity,indeterminate/malignant,8.70,,contact polarized,melanoma,histopathology,True,II,dermoscopic,IL_4668218,,,,True,IP_2763321,True,female
ISIC_6706993,Memorial Sloan Kettering Cancer Center,CC-BY,1121,80,anterior torso,malignant,10.10,,,melanoma,histopathology,False,II,clinical: close-up,IL_4657752,,,,True,IP_2597637,True,male
ISIC_6714559,Memorial Sloan Kettering Cancer Center,CC-BY,743,60,lateral torso,benign,,,non-contact polarized,,,True,IV,dermoscopic,IL_2548767,,,,True,IP_4901886,,male
ISIC_6720909,Memorial Sloan Kettering Cancer Center,CC-BY,1233,80,lower extremity,malignant,10.40,,contact non-polarized,melanoma,histopathology,False,II,dermoscopic,IL_1962864,,,,True,IP_2597637,True,male
ISIC_6779786,Memorial Sloan Kettering Cancer Center,CC-BY,2287,55,anterior torso,benign,,,,,,True,IV,clinical: close-up,IL_2668505,,,,True,IP_1238256,,female
ISIC_6795249,Memorial Sloan Kettering Cancer Center,CC-BY,317,45,lower extremity,benign,,,contact polarized,,,True,I,dermoscopic,IL_2775050,,,,True,IP_3227071,,female
ISIC_6929321,Memorial Sloan Kettering Cancer Center,CC-BY,84,25,upper extremity,benign,,,contact non-polarized,,,True,II,dermoscopic,IL_9094477,,,,True,IP_4003333,,female
ISIC_6957959,Memorial Sloan Kettering Cancer Center,CC-BY,2287,55,anterior torso,benign,,,contact non-polarized,,,True,IV,dermoscopic,IL_2668505,,,,True,IP_1238256,,female
ISIC_6959281,Memorial Sloan Kettering Cancer Center,CC-0,1121,80,anterior torso,malignant,10.10,True,non-contact polarized,melanoma,histopathology,False,II,dermoscopic,IL_2070313,invasive melanoma,0.50,False,True,IP_1999627,True,male
ISIC_6985763,Memorial Sloan Kettering Cancer Center,CC-BY,1736,30,lower extremity,benign,6.60,,non-contact polarized,nevus,histopathology,True,II,dermoscopic,IL_2480900,,,,True,IP_4003333,True,female
ISIC_7239167,Memorial Sloan Kettering Cancer Center,CC-BY,84,25,lower extremity,benign,,,contact non-polarized,,,True,II,dermoscopic,IL_2480900,,,,True,IP_4003333,,female
ISIC_7244280,Memorial Sloan Kettering Cancer Center,CC-BY,1639,65,lower extremity,indeterminate/malignant,8.70,,,melanoma,histopathology,True,II,clinical: close-up,IL_4668218,,,,True,IP_2763321,True,female
ISIC_7288606,Memorial Sloan Kettering Cancer Center,CC-BY,743,60,lateral torso,benign,,,,,,True,IV,clinical: close-up,IL_2548767,,,,True,IP_4901886,,male
ISIC_7365059,Memorial Sloan Kettering Cancer Center,CC-BY,1639,65,lower extremity,indeterminate/malignant,8.70,,contact polarized,melanoma,histopathology,True,II,dermoscopic,IL_4668218,,,,True,IP_2763321,True,female
ISIC_7428145,Memorial Sloan Kettering Cancer Center,CC-BY,78,80,anterior torso,benign,,,contact non-polarized,,,False,II,dermoscopic,IL_4657752,,,,True,IP_2597637,,male
ISIC_7508382,Memorial Sloan Kettering Cancer Center,CC-BY-NC,1464,50,anterior torso,benign,,False,,,single image expert consensus,,,dermoscopic,IL_3480492,,,,,IP_9563768,,female
ISIC_7509096,Memorial Sloan Kettering Cancer Center,CC-0,2020,50,lower extremity,benign,3.90,True,contact polarized,nevus,histopathology,True,I,dermoscopic,IL_2141559,,,,True,IP_0777867,True,female
ISIC_7529219,Memorial Sloan Kettering Cancer Center,CC-BY,1736,30,lower extremity,benign,6.60,,,nevus,histopathology,True,II,clinical: close-up,IL_2480900,,,,True,IP_4003333,True,female
ISIC_7559201,Memorial Sloan Kettering Cancer Center,CC-BY,2497,55,anterior torso,benign,6.60,,contact non-polarized,nevus,histopathology,True,IV,dermoscopic,IL_2668505,,,,True,IP_1238256,True,female
ISIC_7609412,Memorial Sloan Kettering Cancer Center,CC-0,2887,60,posterior torso,benign,5.30,True,non-contact polarized,nevus,histopathology,False,IV,dermoscopic,IL_3149459,,,,True,IP_7207550,False,male
ISIC_7727119,Memorial Sloan Kettering Cancer Center,CC-BY,2887,60,posterior torso,benign,5.30,,,nevus,histopathology,False,IV,clinical: close-up,IL_6156202,,,,True,IP_0892965,False,male
ISIC_7774359,Memorial Sloan Kettering Cancer Center,CC-BY,317,45,lower extremity,benign,,,,,,True,I,clinical: close-up,IL_2775050,,,,True,IP_3227071,,female
ISIC_8077297,Memorial Sloan Kettering Cancer Center,CC-BY,106,35,anterior torso,benign,,,contact non-polarized,,,True,II,dermoscopic,IL_8547824,,,,True,IP_7407753,,female
ISIC_8092280,Memorial Sloan Kettering Cancer Center,CC-BY,2887,60,posterior torso,benign,5.30,,,nevus,histopathology,False,IV,clinical: close-up,IL_6156202,,,,True,IP_0892965,False,male
ISIC_8120765,Memorial Sloan Kettering Cancer Center,CC-BY-NC,1524,55,posterior torso,benign,,False,,,single image expert consensus,,,dermoscopic,IL_3149459,,,,,IP_7207550,,male
ISIC_8181345,Memorial Sloan Kettering Cancer Center,CC-BY,2360,40,lateral torso,benign,4.20,,contact non-polarized,nevus,histopathology,True,II,dermoscopic,IL_8547824,,,,True,IP_7407753,True,female
ISIC_8353193,Memorial Sloan Kettering Cancer Center,CC-BY,1639,65,lower extremity,indeterminate/malignant,8.70,,,melanoma,histopathology,True,II,clinical: close-up,IL_4668218,,,,True,IP_2763321,True,female
ISIC_8398838,Memorial Sloan Kettering Cancer Center,CC-BY,1524,55,posterior torso,benign,,,contact non-polarized,,,False,IV,dermoscopic,IL_6156202,,,,True,IP_0892965,False,male
ISIC_8413742,Memorial Sloan Kettering Cancer Center,CC-BY,2287,55,anterior torso,benign,,,non-contact polarized,,,True,IV,dermoscopic,IL_2668505,,,,True,IP_1238256,,female
ISIC_8463639,Memorial Sloan Kettering Cancer Center,CC-BY,78,80,anterior torso,benign,,,contact non-polarized,,,False,II,dermoscopic,IL_4657752,,,,True,IP_2597637,,male
ISIC_8476601,Memorial Sloan Kettering Cancer Center,CC-BY,84,25,upper extremity,benign,,,non-contact polarized,,,True,II,dermoscopic,IL_9094477,,,,True,IP_4003333,,female
ISIC_8500015,Memorial Sloan Kettering Cancer Center,CC-BY,1736,30,lower extremity,benign,6.60,,,nevus,histopathology,True,II,clinical: close-up,IL_2480900,,,,True,IP_4003333,True,female
ISIC_8568104,Memorial Sloan Kettering Cancer Center,CC-BY,1736,30,lower extremity,benign,6.60,,non-contact polarized,nevus,histopathology,True,II,dermoscopic,IL_2480900,,,,True,IP_4003333,True,female
ISIC_8694298,Memorial Sloan Kettering Cancer Center,CC-BY,2864,65,lateral torso,indeterminate/benign,,,,atypical melanocytic proliferation,histopathology,True,IV,clinical: close-up,IL_2548767,,,,True,IP_4901886,,male
ISIC_8738186,Memorial Sloan Kettering Cancer Center,CC-BY,1639,65,lower extremity,indeterminate/malignant,8.70,,contact non-polarized,melanoma,histopathology,True,II,dermoscopic,IL_4668218,,,,True,IP_2763321,True,female
ISIC_8763306,Memorial Sloan Kettering Cancer Center,CC-BY,1835,65,lower extremity,indeterminate/malignant,,,contact non-polarized,scar,single image expert consensus,True,II,dermoscopic,IL_4668218,,,,True,IP_2763321,True,female
ISIC_8801733,Memorial Sloan Kettering Cancer Center,CC-BY,78,80,lower extremity,benign,,,contact non-polarized,,,False,II,dermoscopic,IL_1962864,,,,True,IP_2597637,,male
ISIC_8961478,Memorial Sloan Kettering Cancer Center,CC-0,1639,65,lower extremity,indeterminate/malignant,8.70,True,,melanoma,histopathology,True,II,dermoscopic,IL_7149631,invasive melanoma,0.35,False,True,IP_1885773,True,female
ISIC_8990193,Memorial Sloan Kettering Cancer Center,CC-BY,430,55,posterior torso,benign,,,contact non-polarized,,,False,IV,dermoscopic,IL_6156202,,,,True,IP_0892965,False,male
ISIC_8999351,Memorial Sloan Kettering Cancer Center,CC-BY,1639,65,lower extremity,indeterminate/malignant,8.70,,non-contact polarized,melanoma,histopathology,True,II,dermoscopic,IL_4668218,,,,True,IP_2763321,True,female
ISIC_9182038,Memorial Sloan Kettering Cancer Center,CC-BY,78,80,anterior torso,benign,,,contact polarized,,,False,II,dermoscopic,IL_4657752,,,,True,IP_2597637,,male
ISIC_9377549,Memorial Sloan Kettering Cancer Center,CC-BY,1736,30,lower extremity,benign,6.60,,,nevus,histopathology,True,II,clinical: close-up,IL_2480900,,,,True,IP_4003333,True,female
ISIC_9430252,Memorial Sloan Kettering Cancer Center,CC-0,2864,65,lateral torso,indeterminate/benign,8.40,True,contact polarized,atypical melanocytic proliferation,histopathology,True,II,dermoscopic,IL_7958441,,,,True,IP_9067016,True,male
ISIC_9498324,Memorial Sloan Kettering Cancer Center,CC-BY,1736,30,lower extremity,benign,6.60,,,nevus,histopathology,True,II,clinical: close-up,IL_2480900,,,,True,IP_4003333,True,female
ISIC_9545174,Memorial Sloan Kettering Cancer Center,CC-BY,2068,30,anterior torso,benign,2.50,,non-contact polarized,nevus,histopathology,True,II,dermoscopic,IL_5279585,,,,True,IP_6802244,False,female
ISIC_9600126,Memorial Sloan Kettering Cancer Center,CC-BY,430,55,posterior torso,benign,,,,,,False,IV,clinical: close-up,IL_6156202,,,,True,IP_0892965,False,male
ISIC_9708499,Memorial Sloan Kettering Cancer Center,CC-BY,2887,60,posterior torso,benign,5.30,,,nevus,histopathology,False,IV,clinical: close-up,IL_6156202,,,,True,IP_0892965,False,male
ISIC_9904561,Memorial Sloan Kettering Cancer Center,CC-BY,317,45,lower extremity,benign,,,non-contact polarized,,,True,I,dermoscopic,IL_2775050,,,,True,IP_3227071,,female
ISIC_9923238,Memorial Sloan Kettering Cancer Center,CC-BY,2887,60,posterior torso,benign,5.30,,contact polarized,nevus,histopathology,False,IV,dermoscopic,IL_6156202,,,,True,IP_0892965,False,male
ISIC_9973437,Memorial Sloan Kettering Cancer Center,CC-BY,78,80,lower extremity,benign,,,non-contact polarized,,,False,II,dermoscopic,IL_1962864,,,,True,IP_2597637,,male