isic_id,attribution,copyright_license,age_approx,anatom_site_general,benign_malignant,clin_size_long_diam_mm,concomitant_biopsy,dermoscopic_type,diagnosis,diagnosis_confirm_type,family_hx_mm,image_type,lesion_id,mel_class,mel_thick_mm,mel_type,mel_ulcer,melanocytic,nevus_type,patient_id,personal_hx_mm,sex
ISIC_0012255,Anonymous,CC-0,30,,benign,,True,contact non-polarized,nevus,histopathology,,dermoscopic,,,,,,True,nevus NOS,,,female
ISIC_0012346,Anonymous,CC-0,50,,benign,,True,contact non-polarized,nevus,histopathology,,dermoscopic,,,,,,True,nevus NOS,,,female
ISIC_0012576,Anonymous,CC-0,70,lower extremity,benign,3.00,True,,nevus,histopathology,False,dermoscopic,,,,,,True,,,False,female
ISIC_0012585,Anonymous,CC-0,25,posterior torso,benign,3.00,False,,nevus,single image expert consensus,False,dermoscopic,,,,,,True,,,False,female
ISIC_0012623,Anonymous,CC-0,85,head/neck,benign,4.50,True,,nevus,histopathology,False,dermoscopic,,,,,,True,,,False,female
ISIC_0012627,Anonymous,CC-0,45,upper extremity,benign,8.00,True,,nevus,histopathology,False,dermoscopic,,,,,,True,,,True,male
ISIC_0012633,Anonymous,CC-0,75,lower extremity,malignant,25.00,True,,melanoma,histopathology,False,dermoscopic,,,,,,True,,,True,female
ISIC_0012643,Anonymous,CC-0,55,anterior torso,benign,4.00,True,,nevus,histopathology,False,dermoscopic,,,,,,True,,,False,female
ISIC_0015294,Anonymous,CC-0,30,lateral torso,benign,,True,contact non-polarized,nevus,histopathology,,dermoscopic,IL_7423663,,,,,True,,IP_7795503,,female
ISIC_0015351,Anonymous,CC-0,25,lower extremity,benign,,True,contact non-polarized,nevus,histopathology,,dermoscopic,IL_6737646,,,,,True,,IP_2473924,,female
ISIC_0015370,Anonymous,CC-0,35,anterior torso,benign,,True,contact non-polarized,nevus,histopathology,,dermoscopic,IL_2936677,,,,,True,,IP_2167611,,female
ISIC_0015462,Anonymous,CC-0,55,lower extremity,malignant,,True,contact non-polarized,melanoma,histopathology,,dermoscopic,IL_6925537,,,,,True,,IP_2916502,,male
ISIC_0015480,Anonymous,CC-0,30,anterior torso,benign,,True,contact non-polarized,nevus,histopathology,,dermoscopic,IL_6039768,,,,,True,,IP_7795503,,female
ISIC_0015492,Anonymous,CC-0,,upper extremity,benign,,True,contact non-polarized,nevus,histopathology,,dermoscopic,IL_6407945,,,,,True,,IP_1154332,,female
ISIC_0015518,Anonymous,CC-0,40,head/neck,malignant,,True,contact non-polarized,melanoma,histopathology,,dermoscopic,IL_0658720,,,,,True,,IP_6597630,,female
ISIC_0015552,Anonymous,CC-0,,posterior torso,benign,,True,contact non-polarized,seborrheic keratosis,histopathology,,dermoscopic,IL_6326972,,,,,False,,IP_2774683,,male
ISIC_0015590,Anonymous,CC-0,60,upper extremity,benign,,True,contact non-polarized,nevus,histopathology,,dermoscopic,IL_0218335,,,,,True,,IP_7188547,,male
ISIC_0015634,Anonymous,CC-0,,upper extremity,benign,,True,contact non-polarized,nevus,histopathology,,dermoscopic,IL_2040001,,,,,True,,IP_4242831,,female
ISIC_0016351,"Department of Dermatology, Medical University of Vienna",CC-BY-NC,,,benign,,False,,nevus,single image expert consensus,,dermoscopic,,,,,,True,,,,
ISIC_0016714,"Department of Dermatology, Medical University of Vienna",CC-BY-NC,,,benign,,False,,nevus,single image expert consensus,,dermoscopic,,,,,,True,,,,
ISIC_0016804,"Department of Dermatology, Medical University of Vienna",CC-BY-NC,,,benign,,False,,nevus,single image expert consensus,,dermoscopic,,,,,,True,,,,
ISIC_0017341,"Department of Dermatology, Medical University of Vienna",CC-BY-NC,,,benign,,False,,nevus,single image expert consensus,,dermoscopic,,,,,,True,,,,
ISIC_0017398,"Department of Dermatology, Medical University of Vienna",CC-BY-NC,,,malignant,,True,,melanoma,histopathology,,dermoscopic,,,,,,True,,,,
ISIC_0017399,"Department of Dermatology, Medical University of Vienna",CC-BY-NC,,,malignant,,True,,melanoma,histopathology,,dermoscopic,,,,,,True,,,,
ISIC_0017460,"Department of Dermatology, Medical University of Vienna",CC-BY-NC,,,malignant,,True,,melanoma,histopathology,,dermoscopic,,,,,,True,,,,
ISIC_0017474,"Department of Dermatology, Medical University of Vienna",CC-BY-NC,,,malignant,,True,,melanoma,histopathology,,dermoscopic,,,,,,True,,,,
ISIC_0017702,"Department of Dermatology, Medical University of Vienna",CC-BY-NC,35,anterior torso,benign,,False,,nevus,serial imaging showing no change,,dermoscopic,,,,,,True,,IP_1529701,,male
ISIC_0017755,"Department of Dermatology, Medical University of Vienna",CC-BY-NC,25,lower extremity,benign,,False,,nevus,serial imaging showing no change,,dermoscopic,,,,,,True,,IP_6048360,,female
ISIC_0018111,"Department of Dermatology, Medical University of Vienna",CC-BY-NC,60,lower extremity,benign,,False,,nevus,serial imaging showing no change,,dermoscopic,,,,,,True,,IP_1483067,,male
ISIC_0018179,"Department of Dermatology, Medical University of Vienna",CC-BY-NC,45,anterior torso,benign,,True,,nevus,histopathology,,dermoscopic,,,,,,True,,IP_7366086,,male
ISIC_0018248,"Department of Dermatology, Medical University of Vienna",CC-BY-NC,30,anterior torso,benign,,False,,nevus,serial imaging showing no change,,dermoscopic,,,,,,True,,IP_2979884,,female
ISIC_0018375,"Department of Dermatology, Medical University of Vienna",CC-BY-NC,35,posterior torso,benign,,False,,nevus,serial imaging showing no change,,dermoscopic,,,,,,True,,IP_9354082,,female
ISIC_0018472,"Department of Dermatology, Medical University of Vienna",CC-BY-NC,45,lower extremity,benign,,False,,nevus,serial imaging showing no change,,dermoscopic,,,,,,True,,IP_7916283,,female
ISIC_0018521,"Department of Dermatology, Medical University of Vienna",CC-BY-NC,10,lower extremity,benign,,False,,nevus,serial imaging showing no change,,dermoscopic,,,,,,True,,IP_8228734,,female
ISIC_0018556,"Department of Dermatology, Medical University of Vienna",CC-BY-NC,40,lower extremity,benign,,True,,nevus,histopathology,,dermoscopic,,,,,,True,,IP_2070254,,male
ISIC_0018611,"Department of Dermatology, Medical University of Vienna",CC-BY-NC,30,lower extremity,benign,,False,,nevus,serial imaging showing no change,,dermoscopic,,,,,,True,,IP_0343426,,male
ISIC_0018680,"Department of Dermatology, Medical University of Vienna",CC-BY-NC,25,lower extremity,benign,,False,,nevus,serial imaging showing no change,,dermoscopic,,,,,,True,,IP_4684988,,male
ISIC_0019049,"Department of Dermatology, Medical University of Vienna",CC-BY-NC,50,upper extremity,benign,,False,,nevus,serial imaging showing no change,,dermoscopic,,,,,,True,,IP_4634212,,male
ISIC_0019309,"Department of Dermatology, Medical University of Vienna",CC-BY-NC,40,posterior torso,benign,,False,,nevus,serial imaging showing no change,,dermoscopic,,,,,,True,,IP_2056799,,female
ISIC_0019334,"Department of Dermatology, Medical University of Vienna",CC-BY-NC,35,posterior torso,malignant,,True,,melanoma,histopathology,,dermoscopic,,,,,,True,,IP_1185654,,female
ISIC_0019723,"Department of Dermatology, Medical University of Vienna",CC-BY-NC,35,anterior torso,benign,,False,,nevus,serial imaging showing no change,,dermoscopic,,,,,,True,,IP_1077050,,female
ISIC_0019794,"Department of Dermatology, Medical University of Vienna",CC-BY-NC,40,palms/soles,benign,,False,,nevus,serial imaging showing no change,,dermoscopic,,,,,,True,,IP_7225371,,female
ISIC_0019883,"Department of Dermatology, Medical University of Vienna",CC-BY-NC,20,palms/soles,benign,,False,,nevus,serial imaging showing no change,,dermoscopic,,,,,,True,,IP_7991027,,male
ISIC_0020233,"Department of Dermatology, Medical University of Vienna",CC-BY-NC,35,lower extremity,benign,,False,,nevus,serial imaging showing no change,,dermoscopic,,,,,,True,,IP_2344309,,female
ISIC_0020418,"Department of Dermatology, Medical University of Vienna",CC-BY-NC,35,posterior torso,benign,,False,,nevus,serial imaging showing no change,,dermoscopic,,,,,,True,,IP_9801665,,female
ISIC_0020861,"Department of Dermatology, Medical University of Vienna",CC-BY-NC,25,upper extremity,benign,,False,,nevus,serial imaging showing no change,,dermoscopic,,,,,,True,,IP_5906360,,female
ISIC_0020893,"Department of Dermatology, Medical University of Vienna",CC-BY-NC,30,upper extremity,benign,,False,,nevus,serial imaging showing no change,,dermoscopic,,,,,,True,,IP_5903920,,male
ISIC_0020953,Anonymous,CC-0,50,anterior torso,benign,,True,non-contact polarized,nevus,histopathology,True,dermoscopic,,,,,,True,nevus NOS,IP_1670350,False,male
ISIC_0020999,Anonymous,CC-0,65,anterior torso,benign,,True,contact non-polarized,seborrheic keratosis,histopathology,False,dermoscopic,,,,,,False,,IP_0734753,False,male
ISIC_0021037,Anonymous,CC-0,45,head/neck,malignant,,True,non-contact polarized,seborrheic keratosis,histopathology,False,dermoscopic,,,,,,False,,IP_4795959,False,male
ISIC_0021041,Anonymous,CC-0,85,anterior torso,benign,,True,non-contact polarized,seborrheic keratosis,histopathology,True,dermoscopic,,,,,,False,,IP_4901949,True,male
ISIC_0021152,Anonymous,CC-0,50,lower extremity,benign,,True,contact non-polarized,nevus,histopathology,False,dermoscopic,,,,,,True,nevus NOS,IP_1748164,False,male
ISIC_0021158,Anonymous,CC-0,75,posterior torso,benign,,True,non-contact polarized,nevus,histopathology,False,dermoscopic,,,,,,True,nevus NOS,IP_8977992,False,male
ISIC_0021202,Anonymous,CC-0,20,posterior torso,benign,,True,non-contact polarized,nevus,histopathology,False,dermoscopic,,,,,,True,nevus NOS,IP_9643949,False,male
ISIC_0021251,Anonymous,CC-0,75,posterior torso,benign,,True,non-contact polarized,nevus,histopathology,False,dermoscopic,,,,,,True,nevus NOS,IP_0732889,True,female
ISIC_0021448,Anonymous,CC-0,65,posterior torso,benign,,True,contact polarized,nevus,histopathology,False,dermoscopic,,,,,,True,nevus NOS,IP_7696498,True,male
ISIC_0021449,Anonymous,CC-0,65,posterior torso,benign,,True,non-contact polarized,nevus,histopathology,False,dermoscopic,,,,,,True,nevus NOS,IP_7696498,True,male
ISIC_0021504,Anonymous,CC-0,75,lower extremity,benign,,True,contact non-polarized,nevus,histopathology,False,dermoscopic,,,,,,True,nevus NOS,IP_8103568,False,male
ISIC_0021714,Anonymous,CC-0,85,head/neck,benign,,True,contact non-polarized,seborrheic keratosis,histopathology,False,dermoscopic,,,,,,False,,IP_6710314,True,male
ISIC_0021762,Anonymous,CC-0,25,upper extremity,benign,,True,contact non-polarized,nevus,histopathology,True,dermoscopic,,,,,,True,nevus NOS,IP_7676283,False,male
ISIC_0021816,Anonymous,CC-0,65,posterior torso,malignant,,True,contact non-polarized,melanoma,histopathology,False,dermoscopic,,melanoma in situ,0.00,,,True,,IP_2677757,False,male
ISIC_0021904,Anonymous,CC-0,65,posterior torso,benign,,True,contact polarized,nevus,histopathology,False,dermoscopic,,,,,,True,,IP_5895991,True,male
ISIC_0021914,Anonymous,CC-0,60,head/neck,benign,,True,contact polarized,seborrheic keratosis,histopathology,True,dermoscopic,,,,,,False,,IP_1076728,False,male
ISIC_0021990,Anonymous,CC-0,40,anterior torso,benign,,True,non-contact polarized,nevus,histopathology,True,dermoscopic,,,,,,True,nevus NOS,IP_6782811,False,female
ISIC_0022029,Anonymous,CC-0,75,anterior torso,benign,,True,non-contact polarized,nevus,histopathology,False,dermoscopic,,,,,,True,,IP_2809240,True,male
ISIC_0022039,Anonymous,CC-0,40,lower extremity,benign,,True,contact polarized,nevus,histopathology,True,dermoscopic,,,,,,True,nevus NOS,IP_7278963,True,female
ISIC_0022147,Anonymous,CC-0,25,posterior torso,benign,,True,contact non-polarized,nevus,histopathology,True,dermoscopic,,,,,,True,nevus NOS,IP_7932282,True,female
ISIC_0022192,Anonymous,CC-0,70,anterior torso,benign,,True,contact polarized,seborrheic keratosis,histopathology,False,dermoscopic,,,,,,False,,IP_5150288,False,female
ISIC_0022221,Anonymous,CC-0,65,head/neck,benign,,True,contact non-polarized,nevus,histopathology,True,dermoscopic,,,,,,True,,IP_7464767,False,male
ISIC_0022657,Anonymous,CC-0,40,posterior torso,benign,,True,contact polarized,nevus,histopathology,True,dermoscopic,,,,,,True,nevus NOS,IP_8855139,False,female
ISIC_0022738,Anonymous,CC-0,20,lower extremity,benign,,True,non-contact polarized,nevus,histopathology,False,dermoscopic,,,,,,True,nevus NOS,IP_0968729,False,male
ISIC_0023371,Anonymous,CC-0,70,upper extremity,malignant,,True,non-contact polarized,melanoma,histopathology,False,dermoscopic,,invasive melanoma,0.24,superficial spreading melanoma,False,True,,IP_6965066,False,male
ISIC_0023508,Anonymous,CC-0,55,lower extremity,malignant,,True,contact non-polarized,melanoma,histopathology,True,dermoscopic,,melanoma in situ,0.00,,,True,,IP_6476463,False,female
ISIC_0023628,Anonymous,CC-0,30,lateral torso,benign,,True,contact non-polarized,nevus,histopathology,False,dermoscopic,,,,,,True,nevus NOS,IP_4466641,True,male
ISIC_0023678,Anonymous,CC-0,40,upper extremity,benign,,True,contact polarized,nevus,histopathology,False,dermoscopic,,,,,,True,,IP_2605994,True,female
ISIC_0023755,Anonymous,CC-0,80,head/neck,malignant,,True,non-contact polarized,melanoma,histopathology,False,dermoscopic,,,0.37,,,True,,IP_1315290,False,female
ISIC_0023831,Anonymous,CC-0,55,posterior torso,benign,,True,non-contact polarized,nevus,histopathology,False,dermoscopic,,,,,,True,nevus NOS,IP_3103695,True,male
ISIC_0023900,Anonymous,CC-0,50,upper extremity,malignant,,True,contact non-polarized,melanoma,histopathology,False,dermoscopic,,melanoma in situ,0.00,,,True,,IP_4577858,True,male
ISIC_0023904,Anonymous,CC-0,30,lateral torso,benign,,True,contact polarized,nevus,histopathology,False,dermoscopic,,,,,,True,,IP_1083427,True,male
ISIC_0023924,Anonymous,CC-0,35,lower extremity,malignant,,True,contact polarized,melanoma,histopathology,False,dermoscopic,,melanoma in situ,0.00,,,True,,IP_6338367,True,male
ISIC_0023936,Anonymous,CC-0,25,posterior torso,benign,,True,contact non-polarized,nevus,histopathology,False,dermoscopic,,,,,,True,,IP_6810518,False,female
ISIC_0024135,Anonymous,CC-0,35,posterior torso,benign,,True,non-contact polarized,nevus,histopathology,False,dermoscopic,,,,,,True,nevus NOS,IP_4121619,False,male
ISIC_0036073,Anonymous,CC-0,,,malignant,,True,,melanoma,histopathology,,dermoscopic,,,,,,True,,IP_5864269,,
ISIC_0036085,Anonymous,CC-0,,,malignant,,True,,melanoma,histopathology,,dermoscopic,,,,,,True,,IP_3937304,,
ISIC_0036098,Anonymous,CC-0,,,malignant,,True,,melanoma,histopathology,,dermoscopic,,,,,,True,,IP_5423841,,
ISIC_0036101,Anonymous,CC-0,,,malignant,,True,,melanoma,histopathology,,dermoscopic,,,,,,True,,IP_2338056,,
ISIC_0036121,Anonymous,CC-0,,,malignant,,True,,melanoma,histopathology,,dermoscopic,,,,,,True,,IP_9347977,,
ISIC_0036147,Anonymous,CC-0,,,benign,,False,,nevus,,,dermoscopic,,,,,,True,,IP_3910464,,
ISIC_0036174,Anonymous,CC-0,,,benign,,False,,nevus,,,dermoscopic,,,,,,True,,IP_9501362,,
ISIC_0036206,Anonymous,CC-0,,,benign,,False,,nevus,,,dermoscopic,,,,,,True,,IP_3489471,,
ISIC_0036236,Anonymous,CC-0,,,benign,,False,,nevus,,,dermoscopic,,,,,,True,,IP_4088517,,
ISIC_0036237,Anonymous,CC-0,,,benign,,False,,nevus,,,dermoscopic,,,,,,True,,IP_3243498,,
ISIC_0036240,Anonymous,CC-0,,,benign,,False,,nevus,,,dermoscopic,,,,,,True,,IP_9672897,,
ISIC_0036247,Anonymous,CC-0,,,benign,,False,,seborrheic keratosis,,,dermoscopic,,,,,,False,,IP_1137440,,
ISIC_0036281,Anonymous,CC-0,,,malignant,,True,,melanoma,histopathology,,dermoscopic,,,,,,True,,IP_5671531,,
ISIC_0036291,Anonymous,CC-0,,,benign,,False,,nevus,,,dermoscopic,,,,,,True,,IP_8725423,,
ISIC_0036306,Anonymous,CC-0,,,benign,,False,,nevus,,,dermoscopic,,,,,,True,,IP_3926298,,
ISIC_0036321,Anonymous,CC-0,,,benign,,False,,nevus,,,dermoscopic,,,,,,True,,IP_2665491,,
ISIC_0036328,Anonymous,CC-0,,,benign,,False,,nevus,,,dermoscopic,,,,,,True,,IP_4611214,,
ISIC_0036333,Anonymous,CC-0,,,benign,,False,,nevus,,,dermoscopic,,,,,,True,,IP_8792657,,
