isic_id,attribution,copyright_license,age_approx,anatom_site_general,benign_malignant,clin_size_long_diam_mm,concomitant_biopsy,dermoscopic_type,diagnosis,diagnosis_confirm_type,family_hx_mm,image_type,lesion_id,mel_class,mel_thick_mm,mel_type,mel_ulcer,melanocytic,nevus_type,patient_id,personal_hx_mm,sex
ISIC_0012169,Anonymous,CC-0,75,,benign,,True,contact non-polarized,seborrheic keratosis,histopathology,,dermoscopic,,,,,,False,,,,female
ISIC_0012236,Anonymous,CC-0,50,,benign,,True,contact non-polarized,nevus,histopathology,,dermoscopic,,,,,,True,nevus NOS,,,male
ISIC_0012292,Anonymous,CC-0,15,,benign,,True,contact non-polarized,nevus,histopathology,,dermoscopic,,,,,,True,nevus NOS,,,female
ISIC_0012302,Anonymous,CC-0,40,,benign,,True,contact non-polarized,nevus,histopathology,,dermoscopic,,,,,,True,nevus NOS,,,male
ISIC_0012337,Anonymous,CC-0,45,,benign,,True,contact non-polarized,nevus,histopathology,,dermoscopic,,,,,,True,nevus NOS,,,female
ISIC_0012373,Anonymous,CC-0,40,,benign,,True,contact non-polarized,seborrheic keratosis,histopathology,,dermoscopic,,,,,,False,,,,male
ISIC_0012405,Anonymous,CC-0,45,,benign,,True,contact non-polarized,nevus,histopathology,,dermoscopic,,,,,,True,nevus NOS,,,male
ISIC_0012418,Anonymous,CC-0,40,,malignant,,True,contact non-polarized,melanoma,histopathology,,dermoscopic,,,,,,True,,,,female
ISIC_0012456,Anonymous,CC-0,30,,benign,,True,contact non-polarized,nevus,histopathology,,dermoscopic,,,,,,True,nevus NOS,,,female
ISIC_0012472,Anonymous,CC-0,55,,malignant,,True,contact non-polarized,melanoma,histopathology,,dermoscopic,,,,,,True,,,,male
ISIC_0012479,Anonymous,CC-0,55,,benign,,True,contact non-polarized,nevus,histopathology,,dermoscopic,,,,,,True,nevus NOS,,,male
ISIC_0012558,Anonymous,CC-0,55,lower extremity,benign,3.00,True,,nevus,histopathology,True,dermoscopic,,,,,,True,,,True,male
ISIC_0012559,Anonymous,CC-0,35,anterior torso,benign,2.00,True,,nevus,histopathology,False,dermoscopic,,,,,,True,,,False,female
ISIC_0012560,Anonymous,CC-0,50,lower extremity,benign,2.50,False,,nevus,serial imaging showing no change,True,dermoscopic,,,,,,True,,,False,female
ISIC_0012563,Anonymous,CC-0,60,anterior torso,benign,8.00,True,,nevus,histopathology,False,dermoscopic,,,,,,True,,,False,female
ISIC_0012564,Anonymous,CC-0,55,lower extremity,benign,4.00,True,,nevus,histopathology,True,dermoscopic,,,,,,True,,,False,female
ISIC_0012566,Anonymous,CC-0,70,upper extremity,benign,4.00,False,,nevus,single image expert consensus,True,dermoscopic,,,,,,True,,,True,female
ISIC_0012572,Anonymous,CC-0,40,posterior torso,benign,4.50,False,,nevus,single image expert consensus,False,dermoscopic,,,,,,True,,,False,female
ISIC_0012591,Anonymous,CC-0,35,lower extremity,benign,4.00,True,,nevus,histopathology,False,dermoscopic,,,,,,True,,,False,female
ISIC_0012592,Anonymous,CC-0,80,upper extremity,malignant,5.00,True,,melanoma,histopathology,False,dermoscopic,,,,,,True,,,True,female
ISIC_0012596,Anonymous,CC-0,65,posterior torso,benign,7.00,True,,nevus,histopathology,True,dermoscopic,,,,,,True,,,False,female
ISIC_0012599,Anonymous,CC-0,40,posterior torso,benign,9.00,True,,nevus,histopathology,True,dermoscopic,,,,,,True,,,False,female
ISIC_0012603,Anonymous,CC-0,50,anterior torso,benign,5.00,True,,nevus,histopathology,False,dermoscopic,,,,,,True,,,False,female
ISIC_0012606,Anonymous,CC-0,50,posterior torso,benign,7.00,False,,nevus,single image expert consensus,False,dermoscopic,,,,,,True,,,False,female
ISIC_0012607,Anonymous,CC-0,40,posterior torso,benign,7.00,True,,nevus,histopathology,False,dermoscopic,,,,,,True,,,False,male
ISIC_0012611,Anonymous,CC-0,60,posterior torso,benign,9.00,False,,nevus,serial imaging showing no change,False,dermoscopic,,,,,,True,,,True,male
ISIC_0012624,Anonymous,CC-0,35,upper extremity,benign,3.50,False,,nevus,single image expert consensus,False,dermoscopic,,,,,,True,,,False,male
ISIC_0012625,Anonymous,CC-0,60,head/neck,benign,3.00,True,,nevus,histopathology,False,dermoscopic,,,,,,True,,,True,female
ISIC_0012634,Anonymous,CC-0,60,anterior torso,benign,5.00,True,,nevus,histopathology,False,dermoscopic,,,,,,True,,,True,female
ISIC_0012647,Anonymous,CC-0,60,anterior torso,benign,2.00,True,,nevus,histopathology,False,dermoscopic,,,,,,True,,,False,male
ISIC_0012650,Anonymous,CC-0,25,anterior torso,benign,9.00,True,,nevus,histopathology,False,dermoscopic,,,,,,True,,,False,male
ISIC_0012651,Anonymous,CC-0,25,posterior torso,benign,4.00,True,,nevus,histopathology,False,dermoscopic,,,,,,True,,,False,male
ISIC_0012698,Anonymous,CC-0,20,anterior torso,benign,,True,contact non-polarized,nevus,histopathology,,dermoscopic,IL_4441149,,,,,True,plexiform spindle cell,,,male
ISIC_0012925,Anonymous,CC-0,50,upper extremity,benign,,True,contact non-polarized,nevus,histopathology,,dermoscopic,IL_3550952,,,,,True,nevus NOS,,,female
ISIC_0012935,Anonymous,CC-0,45,anterior torso,benign,,True,contact non-polarized,nevus,histopathology,,dermoscopic,IL_0694833,,,,,True,nevus NOS,,,male
ISIC_0012948,Anonymous,CC-0,70,head/neck,benign,,True,contact non-polarized,nevus,histopathology,,dermoscopic,IL_0580845,,,,,True,nevus NOS,,,female
ISIC_0013143,Anonymous,CC-0,35,posterior torso,benign,,True,contact non-polarized,nevus,histopathology,,dermoscopic,IL_9740929,,,,,True,nevus NOS,,,female
ISIC_0014676,Anonymous,CC-0,45,lower extremity,benign,,True,contact non-polarized,nevus,histopathology,,dermoscopic,IL_1380863,,,,,True,,IP_7813182,,female
ISIC_0014758,Anonymous,CC-0,,,benign,,False,contact non-polarized,nevus,single image expert consensus,,dermoscopic,IL_3254553,,,,,True,,IP_3807646,,
ISIC_0014759,Anonymous,CC-0,35,anterior torso,benign,,True,contact non-polarized,nevus,histopathology,,dermoscopic,IL_9287667,,,,,True,,IP_7607571,,male
ISIC_0014887,Anonymous,CC-0,30,anterior torso,benign,,True,contact non-polarized,nevus,histopathology,,dermoscopic,IL_1849606,,,,,True,,IP_2803450,,male
ISIC_0014888,Anonymous,CC-0,,upper extremity,benign,,True,contact non-polarized,nevus,histopathology,,dermoscopic,IL_8561856,,,,,True,,IP_5495912,,
ISIC_0014905,Anonymous,CC-0,,lateral torso,benign,,False,contact non-polarized,nevus,single image expert consensus,,dermoscopic,IL_5302100,,,,,True,,IP_7938332,,
ISIC_0014906,Anonymous,CC-0,,lower extremity,benign,,True,contact non-polarized,nevus,histopathology,,dermoscopic,IL_8187568,,,,,True,,IP_4352021,,
ISIC_0014953,Anonymous,CC-0,50,posterior torso,malignant,,True,contact non-polarized,melanoma,histopathology,,dermoscopic,IL_8517824,,,,,True,,IP_4576198,,male
ISIC_0014967,Anonymous,CC-0,,anterior torso,benign,,True,contact non-polarized,nevus,histopathology,,dermoscopic,IL_1405279,,,,,True,,IP_0656182,,
ISIC_0014976,Anonymous,CC-0,30,anterior torso,benign,,True,contact non-polarized,nevus,histopathology,,dermoscopic,IL_7801472,,,,,True,,IP_2458043,,female
ISIC_0014997,Anonymous,CC-0,35,lower extremity,benign,,True,contact non-polarized,nevus,histopathology,,dermoscopic,IL_1552082,,,,,True,,IP_2160963,,male
ISIC_0015001,Anonymous,CC-0,45,posterior torso,benign,,True,contact non-polarized,nevus,histopathology,,dermoscopic,IL_2031122,,,,,True,,IP_2406297,,female
ISIC_0015029,Anonymous,CC-0,25,head/neck,benign,,True,contact non-polarized,nevus,histopathology,,dermoscopic,IL_2950715,,,,,True,,IP_4281851,,male
ISIC_0015069,Anonymous,CC-0,30,lateral torso,benign,,True,contact non-polarized,nevus,histopathology,,dermoscopic,IL_0910467,,,,,True,,IP_5515826,,male
ISIC_0015074,Anonymous,CC-0,30,upper extremity,benign,,True,contact non-polarized,nevus,histopathology,,dermoscopic,IL_1017725,,,,,True,,IP_6624869,,male
ISIC_0015085,Anonymous,CC-0,30,anterior torso,benign,,True,contact non-polarized,nevus,histopathology,,dermoscopic,IL_3363888,,,,,True,,IP_8435831,,female
ISIC_0015088,Anonymous,CC-0,35,posterior torso,malignant,,True,contact non-polarized,melanoma,histopathology,,dermoscopic,IL_4787431,,,,,True,,IP_0630443,,female
ISIC_0015092,Anonymous,CC-0,,lower extremity,benign,,True,contact non-polarized,nevus,histopathology,,dermoscopic,IL_2326794,,,,,True,,IP_8222801,,
ISIC_0015094,Anonymous,CC-0,30,posterior torso,benign,,True,contact non-polarized,nevus,histopathology,,dermoscopic,IL_0220403,,,,,True,,IP_0087939,,male
ISIC_0015104,Anonymous,CC-0,20,upper extremity,benign,,True,contact non-polarized,nevus,histopathology,,dermoscopic,IL_1367590,,,,,True,,IP_6997258,,male
ISIC_0015117,Anonymous,CC-0,30,anterior torso,benign,,True,contact non-polarized,nevus,histopathology,,dermoscopic,IL_4624605,,,,,True,,IP_0890476,,male
ISIC_0015120,Anonymous,CC-0,,upper extremity,malignant,,True,contact non-polarized,melanoma,histopathology,,dermoscopic,IL_9980963,,,,,True,,IP_8429800,,female
ISIC_0015121,Anonymous,CC-0,75,anterior torso,malignant,,True,contact non-polarized,melanoma,histopathology,,dermoscopic,IL_6388473,,,,,True,,IP_4497472,,male
ISIC_0015137,Anonymous,CC-0,,anterior torso,benign,,False,contact non-polarized,nevus,single image expert consensus,,dermoscopic,IL_8221663,,,,,True,,IP_9495527,,
ISIC_0015154,Anonymous,CC-0,35,posterior torso,benign,,True,contact non-polarized,nevus,histopathology,,dermoscopic,IL_4642935,,,,,True,,IP_8637061,,male
ISIC_0015165,Anonymous,CC-0,,posterior torso,benign,,True,contact non-polarized,nevus,histopathology,,dermoscopic,IL_5360151,,,,,True,,IP_1584328,,
ISIC_0015169,Anonymous,CC-0,45,posterior torso,malignant,,True,contact non-polarized,melanoma,histopathology,,dermoscopic,IL_1343052,,,,,True,,IP_1938322,,male
ISIC_0015227,Anonymous,CC-0,30,posterior torso,benign,,True,contact non-polarized,nevus,histopathology,,dermoscopic,IL_9951862,,,,,True,,IP_7108438,,male
ISIC_0015228,Anonymous,CC-0,85,head/neck,malignant,,True,contact non-polarized,melanoma,histopathology,,dermoscopic,IL_4373736,,,,,True,,IP_9953240,,female
ISIC_0015257,Anonymous,CC-0,15,lower extremity,benign,,True,contact non-polarized,nevus,histopathology,,dermoscopic,IL_1542751,,,,,True,,IP_0398447,,female
ISIC_0015261,Anonymous,CC-0,10,upper extremity,benign,,True,contact non-polarized,nevus,histopathology,,dermoscopic,IL_5546986,,,,,True,,IP_9289078,,male
ISIC_0015265,Anonymous,CC-0,50,posterior torso,benign,,True,contact non-polarized,nevus,histopathology,,dermoscopic,IL_3144992,,,,,True,,IP_6927289,,male
ISIC_0015275,Anonymous,CC-0,80,lower extremity,benign,,True,contact non-polarized,seborrheic keratosis,histopathology,,dermoscopic,IL_1715360,,,,,False,,IP_7572876,,male
ISIC_0015281,Anonymous,CC-0,45,lower extremity,benign,,True,contact non-polarized,seborrheic keratosis,histopathology,,dermoscopic,IL_2235202,,,,,False,,IP_1499067,,female
ISIC_0015290,Anonymous,CC-0,30,posterior torso,benign,,True,contact non-polarized,nevus,histopathology,,dermoscopic,IL_5167421,,,,,True,,IP_2500938,,female
ISIC_0015338,Anonymous,CC-0,70,posterior torso,benign,,True,contact non-polarized,seborrheic keratosis,histopathology,,dermoscopic,IL_6372664,,,,,False,,IP_2241654,,male
ISIC_0015350,Anonymous,CC-0,,lower extremity,benign,,True,contact non-polarized,nevus,histopathology,,dermoscopic,IL_2326794,,,,,True,,IP_8222801,,
ISIC_0015352,Anonymous,CC-0,35,posterior torso,benign,,True,contact non-polarized,nevus,histopathology,,dermoscopic,IL_5322390,,,,,True,,IP_8915265,,male
ISIC_0015365,Anonymous,CC-0,45,posterior torso,benign,,True,contact non-polarized,nevus,histopathology,,dermoscopic,IL_1132140,,,,,True,,IP_2442737,,female
ISIC_0015366,Anonymous,CC-0,25,posterior torso,benign,,True,contact non-polarized,nevus,histopathology,,dermoscopic,IL_5900280,,,,,True,,IP_9171674,,female
ISIC_0015375,Anonymous,CC-0,70,head/neck,benign,,True,contact non-polarized,seborrheic keratosis,histopathology,,dermoscopic,IL_7826077,,,,,False,,IP_6567265,,female
ISIC_0015380,Anonymous,CC-0,35,anterior torso,benign,,True,contact non-polarized,nevus,histopathology,,dermoscopic,IL_5927519,,,,,True,,IP_9519460,,male
ISIC_0015381,Anonymous,CC-0,70,posterior torso,benign,,True,contact non-polarized,nevus,histopathology,,dermoscopic,IL_7574650,,,,,True,,IP_3568250,,male
ISIC_0015385,Anonymous,CC-0,55,posterior torso,benign,,True,contact non-polarized,seborrheic keratosis,histopathology,,dermoscopic,IL_1723718,,,,,False,,IP_3031329,,male
ISIC_0015389,Anonymous,CC-0,,head/neck,benign,,True,contact non-polarized,seborrheic keratosis,histopathology,,dermoscopic,IL_8965036,,,,,False,,IP_8167723,,
ISIC_0015398,Anonymous,CC-0,25,upper extremity,benign,,True,contact non-polarized,nevus,histopathology,,dermoscopic,IL_6719866,,,,,True,,IP_6616274,,female
ISIC_0015399,Anonymous,CC-0,,head/neck,benign,,True,contact non-polarized,seborrheic keratosis,histopathology,,dermoscopic,IL_9348040,,,,,False,,IP_0303099,,male
ISIC_0015408,Anonymous,CC-0,55,lower extremity,benign,,True,contact non-polarized,nevus,histopathology,,dermoscopic,IL_7601729,,,,,True,,IP_2414786,,female
ISIC_0015430,Anonymous,CC-0,20,upper extremity,benign,,True,contact non-polarized,nevus,histopathology,,dermoscopic,IL_1703339,,,,,True,,IP_8670872,,female
ISIC_0015435,Anonymous,CC-0,85,head/neck,benign,,True,contact non-polarized,seborrheic keratosis,histopathology,,dermoscopic,IL_7951935,,,,,False,,IP_3639010,,male
ISIC_0015438,Anonymous,CC-0,60,upper extremity,benign,,True,contact non-polarized,nevus,histopathology,,dermoscopic,IL_2490049,,,,,True,,IP_1077076,,female
ISIC_0015441,Anonymous,CC-0,50,anterior torso,malignant,,True,contact non-polarized,melanoma,histopathology,,dermoscopic,IL_4369322,,,,,True,,IP_5703644,,male
ISIC_0015448,Anonymous,CC-0,50,upper extremity,benign,,True,contact non-polarized,nevus,histopathology,,dermoscopic,IL_8447745,,,,,True,,IP_2579316,,male
ISIC_0015450,Anonymous,CC-0,50,upper extremity,benign,,True,contact non-polarized,nevus,histopathology,,dermoscopic,IL_8447745,,,,,True,,IP_2579316,,male
ISIC_0015451,Anonymous,CC-0,50,upper extremity,benign,,True,contact non-polarized,nevus,histopathology,,dermoscopic,IL_8447745,,,,,True,,IP_2579316,,male
ISIC_0015463,Anonymous,CC-0,20,posterior torso,benign,,True,contact non-polarized,nevus,histopathology,,dermoscopic,IL_1455619,,,,,True,,IP_6645311,,male
ISIC_0015469,Anonymous,CC-0,40,lower extremity,benign,,True,contact non-polarized,nevus,histopathology,,dermoscopic,IL_1818051,,,,,True,,IP_3798402,,female
ISIC_0015470,Anonymous,CC-0,,posterior torso,benign,,True,contact non-polarized,nevus,histopathology,,dermoscopic,IL_4377550,,,,,True,,IP_5007260,,
ISIC_0015473,Anonymous,CC-0,,anterior torso,benign,,True,contact non-polarized,nevus,histopathology,,dermoscopic,IL_0312324,,,,,True,,IP_0688856,,male
ISIC_0015478,Anonymous,CC-0,30,lower extremity,malignant,,True,contact non-polarized,melanoma,histopathology,,dermoscopic,IL_3945000,,,,,True,,IP_7795503,,female
ISIC_0015479,Anonymous,CC-0,35,anterior torso,benign,,True,contact non-polarized,nevus,histopathology,,dermoscopic,IL_0540776,,,,,True,,IP_7795503,,female
ISIC_0015486,Anonymous,CC-0,,posterior torso,benign,,True,contact non-polarized,nevus,histopathology,,dermoscopic,IL_3547852,,,,,True,,IP_0792978,,female
ISIC_0015501,Anonymous,CC-0,80,lower extremity,benign,,True,contact non-polarized,seborrheic keratosis,histopathology,,dermoscopic,IL_1715360,,,,,False,,IP_7572876,,male
ISIC_0015502,Anonymous,CC-0,15,upper extremity,benign,,True,contact non-polarized,nevus,histopathology,,dermoscopic,IL_7863876,,,,,True,,IP_3774474,,male
ISIC_0015504,Anonymous,CC-0,35,posterior torso,benign,,True,contact non-polarized,nevus,histopathology,,dermoscopic,IL_5611413,,,,,True,,IP_2466920,,female
ISIC_0015507,Anonymous,CC-0,40,upper extremity,benign,,True,contact non-polarized,nevus,histopathology,,dermoscopic,IL_9775187,,,,,True,,IP_4732713,,male
ISIC_0015520,Anonymous,CC-0,35,upper extremity,benign,,True,contact non-polarized,nevus,histopathology,,dermoscopic,IL_2831747,,,,,True,,IP_2894511,,female
ISIC_0015521,Anonymous,CC-0,55,lower extremity,benign,,True,contact non-polarized,seborrheic keratosis,histopathology,,dermoscopic,IL_1036779,,,,,False,,IP_5457307,,male
ISIC_0015524,Anonymous,CC-0,45,upper extremity,benign,,True,contact non-polarized,nevus,histopathology,,dermoscopic,IL_4050605,,,,,True,,IP_3602221,,female
ISIC_0015525,Anonymous,CC-0,55,lower extremity,benign,,True,contact non-polarized,nevus,histopathology,,dermoscopic,IL_7601729,,,,,True,,IP_2414786,,female
ISIC_0015551,Anonymous,CC-0,30,anterior torso,benign,,True,contact non-polarized,nevus,histopathology,,dermoscopic,IL_8209586,,,,,True,,IP_7579167,,male
ISIC_0015558,Anonymous,CC-0,55,head/neck,benign,,True,contact non-polarized,seborrheic keratosis,histopathology,,dermoscopic,IL_7907475,,,,,False,,IP_1674599,,male
ISIC_0015569,Anonymous,CC-0,40,anterior torso,benign,,True,contact non-polarized,nevus,histopathology,,dermoscopic,IL_5639795,,,,,True,,IP_4681402,,female
ISIC_0015570,Anonymous,CC-0,85,upper extremity,benign,,True,contact non-polarized,nevus,histopathology,,dermoscopic,IL_0992633,,,,,True,,IP_6727616,,male
ISIC_0015578,Anonymous,CC-0,15,lower extremity,benign,,True,contact non-polarized,nevus,histopathology,,dermoscopic,IL_9748507,,,,,True,,IP_2910667,,female
ISIC_0015583,Anonymous,CC-0,35,posterior torso,benign,,True,contact non-polarized,nevus,histopathology,,dermoscopic,IL_8084183,,,,,True,,IP_2239257,,male
ISIC_0015587,Anonymous,CC-0,10,upper extremity,benign,,True,contact non-polarized,nevus,histopathology,,dermoscopic,IL_9888474,,,,,True,,IP_6546807,,male
ISIC_0015596,Anonymous,CC-0,50,lower extremity,malignant,,True,contact non-polarized,melanoma,histopathology,,dermoscopic,IL_5155945,,,,,True,,IP_0110402,,female
ISIC_0015602,Anonymous,CC-0,45,posterior torso,benign,,True,contact non-polarized,nevus,histopathology,,dermoscopic,IL_1132140,,,,,True,,IP_2442737,,female
ISIC_0015606,Anonymous,CC-0,,lower extremity,malignant,,True,contact non-polarized,melanoma,histopathology,,dermoscopic,IL_3758244,,,,,True,,IP_8747638,,male
ISIC_0015613,Anonymous,CC-0,60,anterior torso,benign,,True,contact non-polarized,seborrheic keratosis,histopathology,,dermoscopic,IL_5970544,,,,,False,,IP_2686459,,male
ISIC_0015621,Anonymous,CC-0,,lateral torso,benign,,True,contact non-polarized,nevus,histopathology,,dermoscopic,IL_4587974,,,,,True,,IP_5692649,,
ISIC_0015629,Anonymous,CC-0,40,lower extremity,benign,,True,contact non-polarized,nevus,histopathology,,dermoscopic,IL_1022516,,,,,True,,IP_9224993,,female
ISIC_0015633,Anonymous,CC-0,,head/neck,benign,,True,contact non-polarized,nevus,histopathology,,dermoscopic,IL_1346915,,,,,True,,IP_9354765,,male
ISIC_0015635,Anonymous,CC-0,35,posterior torso,benign,,True,contact non-polarized,nevus,histopathology,,dermoscopic,IL_8755089,,,,,True,,IP_8719699,,male
ISIC_0015637,Anonymous,CC-0,25,anterior torso,benign,,True,contact non-polarized,nevus,histopathology,,dermoscopic,IL_1798585,,,,,True,,IP_1087114,,female
ISIC_0015642,Anonymous,CC-0,30,upper extremity,benign,,True,contact non-polarized,nevus,histopathology,,dermoscopic,IL_4232285,,,,,True,,IP_1087114,,female
ISIC_0015970,Anonymous,CC-0,45,,benign,,True,contact non-polarized,nevus,histopathology,,dermoscopic,,,,,,True,nevus NOS,,,male
ISIC_0015977,Anonymous,CC-0,35,,benign,,True,contact non-polarized,nevus,histopathology,,dermoscopic,,,,,,True,nevus NOS,,,female
ISIC_0016010,Anonymous,CC-0,40,,benign,,True,contact non-polarized,nevus,histopathology,,dermoscopic,,,,,,True,,,,male
ISIC_0016020,Anonymous,CC-0,70,,benign,,True,contact non-polarized,nevus,histopathology,,dermoscopic,,,,,,True,,,,female
ISIC_0016021,Anonymous,CC-0,70,,benign,,True,contact non-polarized,nevus,histopathology,,dermoscopic,,,,,,True,,,,female
ISIC_0016039,Anonymous,CC-0,50,,benign,,True,contact non-polarized,nevus,histopathology,,dermoscopic,,,,,,True,,,,female
ISIC_0016047,Anonymous,CC-0,65,,benign,,True,contact non-polarized,nevus,histopathology,,dermoscopic,,,,,,True,,,,male
ISIC_0016067,Anonymous,CC-0,55,,benign,,True,,nevus,histopathology,,dermoscopic,,,,,,True,,,,female
ISIC_0016186,"Department of Dermatology, Medical University of Vienna",CC-BY-NC,,,benign,,False,,nevus,single image expert consensus,,dermoscopic,,,,,,True,,,,
ISIC_0016197,"Department of Dermatology, Medical University of Vienna",CC-BY-NC,,,benign,,False,,nevus,single image expert consensus,,dermoscopic,,,,,,True,,,,
ISIC_0016199,"Department of Dermatology, Medical University of Vienna",CC-BY-NC,,,benign,,False,,nevus,single image expert consensus,,dermoscopic,,,,,,True,,,,
ISIC_0016211,"Department of Dermatology, Medical University of Vienna",CC-BY-NC,,,benign,,False,,nevus,single image expert consensus,,dermoscopic,,,,,,True,,,,
ISIC_0016274,"Department of Dermatology, Medical University of Vienna",CC-BY-NC,,,benign,,False,,nevus,single image expert consensus,,dermoscopic,,,,,,True,,,,
ISIC_0016318,"Department of Dermatology, Medical University of Vienna",CC-BY-NC,,,benign,,False,,nevus,single image expert consensus,,dermoscopic,,,,,,True,,,,
ISIC_0016344,"Department of Dermatology, Medical University of Vienna",CC-BY-NC,,,benign,,False,,nevus,single image expert consensus,,dermoscopic,,,,,,True,,,,
ISIC_0016363,"Department of Dermatology, Medical University of Vienna",CC-BY-NC,,,benign,,False,,nevus,single image expert consensus,,dermoscopic,,,,,,True,,,,
ISIC_0016364,"Department of Dermatology, Medical University of Vienna",CC-BY-NC,,,benign,,False,,nevus,single image expert consensus,,dermoscopic,,,,,,True,,,,
ISIC_0016438,"Department of Dermatology, Medical University of Vienna",CC-BY-NC,,,malignant,,True,,melanoma,histopathology,,dermoscopic,,,,,,True,,,,
ISIC_0016524,"Department of Dermatology, Medical University of Vienna",CC-BY-NC,,,benign,,False,,nevus,single image expert consensus,,dermoscopic,,,,,,True,,,,
ISIC_0016575,"Department of Dermatology, Medical University of Vienna",CC-BY-NC,,,benign,,False,,nevus,single image expert consensus,,dermoscopic,,,,,,True,,,,
ISIC_0016663,"Department of Dermatology, Medical University of Vienna",CC-BY-NC,,,benign,,False,,nevus,single image expert consensus,,dermoscopic,,,,,,True,,,,
ISIC_0016716,"Department of Dermatology, Medical University of Vienna",CC-BY-NC,,,benign,,False,,nevus,single image expert consensus,,dermoscopic,,,,,,True,,,,
ISIC_0016726,"Department of Dermatology, Medical University of Vienna",CC-BY-NC,,,benign,,False,,nevus,single image expert consensus,,dermoscopic,,,,,,True,,,,
ISIC_0016736,"Department of Dermatology, Medical University of Vienna",CC-BY-NC,,,benign,,False,,nevus,single image expert consensus,,dermoscopic,,,,,,True,,,,
ISIC_0016837,"Department of Dermatology, Medical University of Vienna",CC-BY-NC,,,benign,,False,,nevus,single image expert consensus,,dermoscopic,,,,,,True,,,,
ISIC_0016844,"Department of Dermatology, Medical University of Vienna",CC-BY-NC,,,benign,,False,,nevus,single image expert consensus,,dermoscopic,,,,,,True,,,,
ISIC_0016911,"Department of Dermatology, Medical University of Vienna",CC-BY-NC,,,malignant,,True,,melanoma,histopathology,,dermoscopic,,,,,,True,,,,
ISIC_0016963,"Department of Dermatology, Medical University of Vienna",CC-BY-NC,,,benign,,False,,nevus,single image expert consensus,,dermoscopic,,,,,,True,,,,
ISIC_0017026,"Department of Dermatology, Medical University of Vienna",CC-BY-NC,,,benign,,False,,nevus,single image expert consensus,,dermoscopic,,,,,,True,,,,
ISIC_0017036,"Department of Dermatology, Medical University of Vienna",CC-BY-NC,,,benign,,False,,nevus,single image expert consensus,,dermoscopic,,,,,,True,,,,
ISIC_0017069,"Department of Dermatology, Medical University of Vienna",CC-BY-NC,,,benign,,False,,nevus,single image expert consensus,,dermoscopic,,,,,,True,,,,
ISIC_0017073,"Department of Dermatology, Medical University of Vienna",CC-BY-NC,,,benign,,False,,nevus,single image expert consensus,,dermoscopic,,,,,,True,,,,
ISIC_0017201,"Department of Dermatology, Medical University of Vienna",CC-BY-NC,,,benign,,False,,nevus,single image expert consensus,,dermoscopic,,,,,,True,,,,