isic_id,attribution,copyright_license,age_approx,anatom_site_general,benign_malignant,clin_size_long_diam_mm,concomitant_biopsy,dermoscopic_type,diagnosis,diagnosis_confirm_type,family_hx_mm,image_type,lesion_id,melanocytic,nevus_type,patient_id,personal_hx_mm,sex
ISIC_0000000,Anonymous,CC-0,55,anterior torso,benign,,False,,nevus,,,dermoscopic,,True,,,,female
ISIC_0000001,Anonymous,CC-0,30,anterior torso,benign,,False,,nevus,,,dermoscopic,,True,,,,female
ISIC_0000002,Anonymous,CC-0,60,upper extremity,malignant,,True,,melanoma,histopathology,,dermoscopic,,True,,,,female
ISIC_0000003,Anonymous,CC-0,30,upper extremity,benign,,False,,nevus,,,dermoscopic,,True,,,,male
ISIC_0000004,Anonymous,CC-0,80,posterior torso,malignant,,True,,melanoma,histopathology,,dermoscopic,,True,,,,male
ISIC_0000006,Anonymous,CC-0,25,posterior torso,benign,,False,,nevus,,,dermoscopic,,True,,,,female
ISIC_0000007,Anonymous,CC-0,25,posterior torso,benign,,False,,nevus,,,dermoscopic,,True,,,,female
ISIC_0000008,Anonymous,CC-0,30,anterior torso,benign,,False,,nevus,,,dermoscopic,,True,,,,female
ISIC_0000009,Anonymous,CC-0,30,anterior torso,benign,,False,,nevus,,,dermoscopic,,True,,,,female
ISIC_0000010,Anonymous,CC-0,35,posterior torso,benign,,False,,nevus,,,dermoscopic,,True,,,,female
ISIC_0000011,Anonymous,CC-0,35,lower extremity,benign,,False,,nevus,,,dermoscopic,,True,,,,female
ISIC_0000012,Anonymous,CC-0,30,posterior torso,benign,,False,,nevus,,,dermoscopic,,True,,,,male
ISIC_0000013,Anonymous,CC-0,30,posterior torso,malignant,,True,,melanoma,histopathology,,dermoscopic,,True,,,,female
ISIC_0000014,Anonymous,CC-0,35,posterior torso,benign,,False,,nevus,,,dermoscopic,,True,,,,male
ISIC_0000015,Anonymous,CC-0,35,posterior torso,benign,,False,,nevus,,,dermoscopic,,True,,,,male
ISIC_0000016,Anonymous,CC-0,55,anterior torso,benign,,False,,nevus,,,dermoscopic,,True,,,,female
ISIC_0000017,Anonymous,CC-0,50,posterior torso,benign,,False,,nevus,,,dermoscopic,,True,,,,female
ISIC_0000018,Anonymous,CC-0,30,posterior torso,benign,,False,,nevus,,,dermoscopic,,True,,,,male
ISIC_0000019,Anonymous,CC-0,30,posterior torso,benign,,False,,nevus,,,dermoscopic,,True,,,,female
ISIC_0000020,Anonymous,CC-0,25,anterior torso,benign,,False,,nevus,,,dermoscopic,,True,,,,female
ISIC_0000021,Anonymous,CC-0,55,posterior torso,benign,,False,,nevus,,,dermoscopic,,True,,,,female
ISIC_0000022,Anonymous,CC-0,55,lower extremity,malignant,,True,,melanoma,histopathology,,dermoscopic,,True,,,,female
ISIC_0000023,Anonymous,CC-0,30,anterior torso,benign,,False,,nevus,,,dermoscopic,,True,,,,female
ISIC_0000024,Anonymous,CC-0,45,posterior torso,benign,,False,,nevus,,,dermoscopic,,True,,,,male
ISIC_0000025,Anonymous,CC-0,35,lower extremity,benign,,False,,nevus,,,dermoscopic,,True,,,,female
ISIC_0000026,Anonymous,CC-0,30,lower extremity,malignant,,True,,melanoma,histopathology,,dermoscopic,,True,,,,female
ISIC_0000027,Anonymous,CC-0,35,anterior torso,benign,,False,,nevus,,,dermoscopic,,True,,,,female
ISIC_0000028,Anonymous,CC-0,60,anterior torso,benign,,False,,nevus,,,dermoscopic,,True,,,,male
ISIC_0000029,Anonymous,CC-0,45,posterior torso,malignant,,True,,melanoma,histopathology,,dermoscopic,,True,,,,female
ISIC_0000030,Anonymous,CC-0,55,lower extremity,malignant,,True,,melanoma,histopathology,,dermoscopic,,True,,,,female
ISIC_0000031,Anonymous,CC-0,70,upper extremity,malignant,,True,,melanoma,histopathology,,dermoscopic,,True,,,,male
ISIC_0000032,Anonymous,CC-0,30,posterior torso,benign,,False,,nevus,,,dermoscopic,,True,,,,female
ISIC_0000034,Anonymous,CC-0,30,posterior torso,benign,,False,,nevus,,,dermoscopic,,True,,,,female
ISIC_0000035,Anonymous,CC-0,25,lower extremity,malignant,,True,,melanoma,histopathology,,dermoscopic,,True,,,,female
ISIC_0000036,Anonymous,CC-0,70,upper extremity,malignant,,True,,melanoma,histopathology,,dermoscopic,,True,,,,male
ISIC_0000037,Anonymous,CC-0,70,posterior torso,benign,,False,,nevus,,,dermoscopic,,True,,,,male
ISIC_0000038,Anonymous,CC-0,40,posterior torso,benign,,False,,nevus,,,dermoscopic,,True,,,,female
ISIC_0000039,Anonymous,CC-0,60,posterior torso,benign,,False,,nevus,,,dermoscopic,,True,,,,female
ISIC_0000040,Anonymous,CC-0,65,lower extremity,malignant,,True,,melanoma,histopathology,,dermoscopic,,True,,,,female
ISIC_0000041,Anonymous,CC-0,40,lower extremity,benign,,False,,nevus,,,dermoscopic,,True,,,,female
ISIC_0000042,Anonymous,CC-0,50,anterior torso,benign,,False,,nevus,,,dermoscopic,,True,,,,male
ISIC_0000043,Anonymous,CC-0,35,lower extremity,malignant,,True,,melanoma,histopathology,,dermoscopic,,True,,,,male
ISIC_0000044,Anonymous,CC-0,20,posterior torso,benign,,False,,nevus,,,dermoscopic,,True,,,,male
ISIC_0000045,Anonymous,CC-0,30,lower extremity,benign,,False,,nevus,,,dermoscopic,,True,,,,male
ISIC_0000046,Anonymous,CC-0,60,upper extremity,malignant,,True,,melanoma,histopathology,,dermoscopic,,True,,,,female
ISIC_0000047,Anonymous,CC-0,70,lower extremity,benign,,False,,nevus,,,dermoscopic,,True,,,,male
ISIC_0000048,Anonymous,CC-0,50,anterior torso,benign,,False,,nevus,,,dermoscopic,,True,,,,female
ISIC_0000049,Anonymous,CC-0,80,posterior torso,malignant,,True,,melanoma,histopathology,,dermoscopic,,True,,,,female
ISIC_0000050,Anonymous,CC-0,30,anterior torso,benign,,False,,nevus,,,dermoscopic,,True,,,,male
ISIC_0000051,Anonymous,CC-0,55,upper extremity,benign,,False,,nevus,,,dermoscopic,,True,,,,male
ISIC_0000052,Anonymous,CC-0,40,posterior torso,benign,,False,,nevus,,,dermoscopic,,True,,,,female
ISIC_0000053,Anonymous,CC-0,25,posterior torso,benign,,False,,nevus,,,dermoscopic,,True,,,,female
ISIC_0000054,Anonymous,CC-0,25,lower extremity,malignant,,True,,melanoma,histopathology,,dermoscopic,,True,,,,female
ISIC_0000055,Anonymous,CC-0,40,posterior torso,benign,,False,,nevus,,,dermoscopic,,True,,,,female
ISIC_0000056,Anonymous,CC-0,55,lower extremity,malignant,,True,,melanoma,histopathology,,dermoscopic,,True,,,,female
ISIC_0000057,Anonymous,CC-0,40,lower extremity,benign,,False,,nevus,,,dermoscopic,,True,,,,female
ISIC_0000058,Anonymous,CC-0,40,posterior torso,benign,,False,,nevus,,,dermoscopic,,True,,,,female
ISIC_0000059,Anonymous,CC-0,30,lower extremity,benign,,False,,nevus,,,dermoscopic,,True,,,,female
ISIC_0000060,Anonymous,CC-0,35,posterior torso,benign,,False,,nevus,,,dermoscopic,,True,,,,female
ISIC_0000061,Anonymous,CC-0,35,lower extremity,benign,,False,,nevus,,,dermoscopic,,True,,,,female
ISIC_0000062,Anonymous,CC-0,40,posterior torso,benign,,False,,nevus,,,dermoscopic,,True,,,,female
ISIC_0000063,Anonymous,CC-0,45,anterior torso,benign,,False,,nevus,,,dermoscopic,,True,,,,female
ISIC_0000064,Anonymous,CC-0,40,anterior torso,benign,,False,,nevus,,,dermoscopic,,True,,,,female
ISIC_0000065,Anonymous,CC-0,30,posterior torso,benign,,False,,nevus,,,dermoscopic,,True,,,,female
ISIC_0000066,Anonymous,CC-0,55,posterior torso,benign,,False,,nevus,,,dermoscopic,,True,,,,female
ISIC_0000067,Anonymous,CC-0,45,posterior torso,benign,,False,,nevus,,,dermoscopic,,True,,,,female
ISIC_0000068,Anonymous,CC-0,35,anterior torso,benign,,False,,nevus,,,dermoscopic,,True,,,,female
ISIC_0000069,Anonymous,CC-0,15,anterior torso,benign,,False,,nevus,,,dermoscopic,,True,,,,female
ISIC_0000071,Anonymous,CC-0,25,posterior torso,benign,,False,,nevus,,,dermoscopic,,True,,,,male
ISIC_0000072,Anonymous,CC-0,85,posterior torso,benign,,False,,nevus,,,dermoscopic,,True,,,,male
ISIC_0000073,Anonymous,CC-0,20,posterior torso,benign,,False,,nevus,,,dermoscopic,,True,,,,female
ISIC_0000074,Anonymous,CC-0,25,lower extremity,malignant,,True,,melanoma,histopathology,,dermoscopic,,True,,,,male
ISIC_0000075,Anonymous,CC-0,50,anterior torso,benign,,False,,nevus,,,dermoscopic,,True,,,,female
ISIC_0000077,Anonymous,CC-0,80,upper extremity,malignant,,True,,melanoma,histopathology,,dermoscopic,,True,,,,male
ISIC_0000078,Anonymous,CC-0,85,anterior torso,malignant,,True,,melanoma,histopathology,,dermoscopic,,True,,,,male
ISIC_0000079,Anonymous,CC-0,55,lower extremity,benign,,False,,nevus,,,dermoscopic,,True,,,,female
ISIC_0000080,Anonymous,CC-0,,,benign,,False,,nevus,,,dermoscopic,,True,,,,
ISIC_0000081,Anonymous,CC-0,,,benign,,False,,nevus,,,dermoscopic,,True,,,,
ISIC_0000082,Anonymous,CC-0,,,benign,,False,,nevus,,,dermoscopic,,True,,,,
ISIC_0000085,Anonymous,CC-0,,,benign,,False,,nevus,,,dermoscopic,,True,,,,
ISIC_0000086,Anonymous,CC-0,,,benign,,False,,nevus,,,dermoscopic,,True,,,,
ISIC_0000087,Anonymous,CC-0,,,benign,,False,,nevus,,,dermoscopic,,True,,,,
ISIC_0000088,Anonymous,CC-0,,,benign,,False,,nevus,,,dermoscopic,,True,,,,
ISIC_0000089,Anonymous,CC-0,,,benign,,False,,nevus,,,dermoscopic,,True,,,,
ISIC_0000091,Anonymous,CC-0,,,benign,,False,,nevus,,,dermoscopic,,True,,,,
ISIC_0000092,Anonymous,CC-0,,,benign,,False,,nevus,,,dermoscopic,,True,,,,
ISIC_0000093,Anonymous,CC-0,,,benign,,False,,nevus,,,dermoscopic,,True,,,,
ISIC_0000094,Anonymous,CC-0,,,benign,,False,,nevus,,,dermoscopic,,True,,,,
ISIC_0000095,Anonymous,CC-0,,,benign,,False,,nevus,,,dermoscopic,,True,,,,
ISIC_0000096,Anonymous,CC-0,,,benign,,False,,nevus,,,dermoscopic,,True,,,,
ISIC_0000097,Anonymous,CC-0,,,benign,,False,,nevus,,,dermoscopic,,True,,,,
ISIC_0000098,Anonymous,CC-0,,,benign,,False,,nevus,,,dermoscopic,,True,,,,
ISIC_0000099,Anonymous,CC-0,,,benign,,False,,nevus,,,dermoscopic,,True,,,,
ISIC_0000100,Anonymous,CC-0,,,benign,,False,,nevus,,,dermoscopic,,True,,,,
ISIC_0000101,Anonymous,CC-0,,,benign,,False,,nevus,,,dermoscopic,,True,,,,
ISIC_0000102,Anonymous,CC-0,,,benign,,False,,nevus,,,dermoscopic,,True,,,,
ISIC_0000103,Anonymous,CC-0,,,benign,,False,,nevus,,,dermoscopic,,True,,,,
ISIC_0000104,Anonymous,CC-0,,,benign,,False,,nevus,,,dermoscopic,,True,,,,
ISIC_0000105,Anonymous,CC-0,,,benign,,False,,nevus,,,dermoscopic,,True,,,,
ISIC_0000107,Anonymous,CC-0,,,benign,,False,,nevus,,,dermoscopic,,True,,,,
ISIC_0000108,Anonymous,CC-0,,,benign,,False,,nevus,,,dermoscopic,,True,,,,
ISIC_0000109,Anonymous,CC-0,,,benign,,False,,nevus,,,dermoscopic,,True,,,,
ISIC_0000110,Anonymous,CC-0,,,benign,,False,,nevus,,,dermoscopic,,True,,,,
ISIC_0000111,Anonymous,CC-0,,,benign,,False,,nevus,,,dermoscopic,,True,,,,
ISIC_0000112,Anonymous,CC-0,,,benign,,False,,nevus,,,dermoscopic,,True,,,,
ISIC_0000113,Anonymous,CC-0,,,benign,,False,,nevus,,,dermoscopic,,True,,,,
ISIC_0000114,Anonymous,CC-0,,,benign,,False,,nevus,,,dermoscopic,,True,,,,
ISIC_0000115,Anonymous,CC-0,,,benign,,False,,nevus,,,dermoscopic,,True,,,,
ISIC_0000116,Anonymous,CC-0,,,benign,,False,,nevus,,,dermoscopic,,True,,,,
ISIC_0000117,Anonymous,CC-0,,,benign,,False,,nevus,,,dermoscopic,,True,,,,
ISIC_0000118,Anonymous,CC-0,,,benign,,False,,nevus,,,dermoscopic,,True,,,,
ISIC_0000119,Anonymous,CC-0,,,benign,,False,,nevus,,,dermoscopic,,True,,,,
ISIC_0000120,Anonymous,CC-0,,,benign,,False,,nevus,,,dermoscopic,,True,,,,
ISIC_0000121,Anonymous,CC-0,,,benign,,False,,nevus,,,dermoscopic,,True,,,,
ISIC_0000122,Anonymous,CC-0,,,benign,,False,,nevus,,,dermoscopic,,True,,,,
ISIC_0000123,Anonymous,CC-0,,,benign,,False,,nevus,,,dermoscopic,,True,,,,
ISIC_0000124,Anonymous,CC-0,,,benign,,False,,nevus,,,dermoscopic,,True,,,,
ISIC_0000125,Anonymous,CC-0,,,benign,,False,,nevus,,,dermoscopic,,True,,,,
ISIC_0000126,Anonymous,CC-0,,,benign,,False,,nevus,,,dermoscopic,,True,,,,
ISIC_0000127,Anonymous,CC-0,,,benign,,False,,nevus,,,dermoscopic,,True,,,,
ISIC_0000128,Anonymous,CC-0,,,benign,,False,,nevus,,,dermoscopic,,True,,,,
ISIC_0000129,Anonymous,CC-0,,,benign,,False,,nevus,,,dermoscopic,,True,,,,
ISIC_0000130,Anonymous,CC-0,,,benign,,False,,nevus,,,dermoscopic,,True,,,,
ISIC_0000131,Anonymous,CC-0,,,benign,,False,,nevus,,,dermoscopic,,True,,,,
ISIC_0000132,Anonymous,CC-0,,,benign,,False,,nevus,,,dermoscopic,,True,,,,
ISIC_0000133,Anonymous,CC-0,,,benign,,False,,nevus,,,dermoscopic,,True,,,,
ISIC_0000134,Anonymous,CC-0,,,benign,,False,,nevus,,,dermoscopic,,True,,,,
ISIC_0000135,Anonymous,CC-0,,,benign,,False,,nevus,,,dermoscopic,,True,,,,
ISIC_0000136,Anonymous,CC-0,,,benign,,False,,nevus,,,dermoscopic,,True,,,,
ISIC_0000137,Anonymous,CC-0,,,benign,,False,,nevus,,,dermoscopic,,True,,,,
ISIC_0000138,Anonymous,CC-0,,,benign,,False,,nevus,,,dermoscopic,,True,,,,
ISIC_0000139,Anonymous,CC-0,,,malignant,,True,,melanoma,histopathology,,dermoscopic,,True,,,,
ISIC_0000140,Anonymous,CC-0,,,malignant,,True,,melanoma,histopathology,,dermoscopic,,True,,,,
ISIC_0000141,Anonymous,CC-0,,,malignant,,True,,melanoma,histopathology,,dermoscopic,,True,,,,
ISIC_0000142,Anonymous,CC-0,,,malignant,,True,,melanoma,histopathology,,dermoscopic,,True,,,,
ISIC_0000143,Anonymous,CC-0,,,malignant,,True,,melanoma,histopathology,,dermoscopic,,True,,,,
ISIC_0000145,Anonymous,CC-0,,,malignant,,True,,melanoma,histopathology,,dermoscopic,,True,,,,
ISIC_0000146,Anonymous,CC-0,,,malignant,,True,,melanoma,histopathology,,dermoscopic,,True,,,,
ISIC_0000147,Anonymous,CC-0,,,malignant,,True,,melanoma,histopathology,,dermoscopic,,True,,,,
ISIC_0000148,Anonymous,CC-0,,,malignant,,True,,melanoma,histopathology,,dermoscopic,,True,,,,
ISIC_0000149,Anonymous,CC-0,,,malignant,,True,,melanoma,histopathology,,dermoscopic,,True,,,,
ISIC_0000150,Anonymous,CC-0,,,malignant,,True,,melanoma,histopathology,,dermoscopic,,True,,,,
ISIC_0000151,Anonymous,CC-0,,,malignant,,True,,melanoma,histopathology,,dermoscopic,,True,,,,
ISIC_0000152,Anonymous,CC-0,,,malignant,,True,,melanoma,histopathology,,dermoscopic,,True,,,,
ISIC_0000153,Anonymous,CC-0,,,malignant,,True,,melanoma,histopathology,,dermoscopic,,True,,,,
ISIC_0000154,Anonymous,CC-0,,,malignant,,True,,melanoma,histopathology,,dermoscopic,,True,,,,
ISIC_0000155,Anonymous,CC-0,,,malignant,,True,,melanoma,histopathology,,dermoscopic,,True,,,,
ISIC_0000156,Anonymous,CC-0,,,malignant,,True,,melanoma,histopathology,,dermoscopic,,True,,,,
ISIC_0000157,Anonymous,CC-0,60,upper extremity,malignant,,True,,melanoma,histopathology,,dermoscopic,,True,,,,male
ISIC_0000159,Anonymous,CC-0,15,upper extremity,malignant,,True,,melanoma,histopathology,,dermoscopic,,True,,,,female
ISIC_0000160,Anonymous,CC-0,55,lateral torso,malignant,,True,,melanoma,histopathology,,dermoscopic,,True,,,,male
ISIC_0000161,Anonymous,CC-0,45,anterior torso,malignant,,True,,melanoma,histopathology,,dermoscopic,,True,,,,male
ISIC_0000162,Anonymous,CC-0,40,anterior torso,malignant,,True,,melanoma,histopathology,,dermoscopic,,True,,,,male
ISIC_0000163,Anonymous,CC-0,60,upper extremity,malignant,,True,,melanoma,histopathology,,dermoscopic,,True,,,,male
ISIC_0000164,Anonymous,CC-0,60,upper extremity,malignant,,True,,melanoma,histopathology,,dermoscopic,,True,,,,male
ISIC_0000165,Anonymous,CC-0,15,upper extremity,malignant,,True,,melanoma,histopathology,,dermoscopic,,True,,,,male
ISIC_0000166,Anonymous,CC-0,30,upper extremity,malignant,,True,,melanoma,histopathology,,dermoscopic,,True,,,,female
ISIC_0000167,Anonymous,CC-0,40,posterior torso,malignant,,True,,melanoma,histopathology,,dermoscopic,,True,,,,male
ISIC_0000169,Anonymous,CC-0,70,upper extremity,malignant,,True,,melanoma,histopathology,,dermoscopic,,True,,,,male
ISIC_0000170,Anonymous,CC-0,50,posterior torso,malignant,,True,,melanoma,histopathology,,dermoscopic,,True,,,,male
ISIC_0000171,Anonymous,CC-0,45,posterior torso,malignant,,True,,melanoma,histopathology,,dermoscopic,,True,,,,male
ISIC_0000172,Anonymous,CC-0,35,posterior torso,malignant,,True,,melanoma,histopathology,,dermoscopic,,True,,,,female
ISIC_0000173,Anonymous,CC-0,65,upper extremity,malignant,,True,,melanoma,histopathology,,dermoscopic,,True,,,,male
ISIC_0000174,Anonymous,CC-0,50,upper extremity,malignant,,True,,melanoma,histopathology,,dermoscopic,,True,,,,female
ISIC_0000175,Anonymous,CC-0,35,upper extremity,malignant,,True,,melanoma,histopathology,,dermoscopic,,True,,,,female
ISIC_0000176,Anonymous,CC-0,40,lower extremity,malignant,,True,,melanoma,histopathology,,dermoscopic,,True,,,,female
ISIC_0000177,Anonymous,CC-0,25,anterior torso,benign,,False,,nevus,,,dermoscopic,,True,,,,male
ISIC_0000179,Anonymous,CC-0,35,anterior torso,benign,,False,,nevus,,,dermoscopic,,True,,,,male
ISIC_0000181,Anonymous,CC-0,15,upper extremity,benign,,False,,nevus,,,dermoscopic,,True,,,,female
ISIC_0000182,Anonymous,CC-0,45,anterior torso,benign,,False,,nevus,,,dermoscopic,,True,,,,male
ISIC_0000183,Anonymous,CC-0,30,anterior torso,benign,,False,,nevus,,,dermoscopic,,True,,,,female
ISIC_0000184,Anonymous,CC-0,25,anterior torso,benign,,False,,nevus,,,dermoscopic,,True,,,,female
ISIC_0000185,Anonymous,CC-0,25,posterior torso,benign,,False,,nevus,,,dermoscopic,,True,,,,female
ISIC_0000186,Anonymous,CC-0,5,upper extremity,benign,,False,,nevus,,,dermoscopic,,True,,,,male
ISIC_0000187,Anonymous,CC-0,20,anterior torso,benign,,False,,nevus,,,dermoscopic,,True,,,,female
ISIC_0000188,Anonymous,CC-0,45,posterior torso,benign,,False,,nevus,,,dermoscopic,,True,,,,male
ISIC_0000189,Anonymous,CC-0,30,anterior torso,benign,,False,,nevus,,,dermoscopic,,True,,,,male
ISIC_0000190,Anonymous,CC-0,10,posterior torso,benign,,False,,nevus,,,dermoscopic,,True,,,,female
ISIC_0000191,Anonymous,CC-0,35,anterior torso,benign,,False,,nevus,,,dermoscopic,,True,,,,male
ISIC_0000192,Anonymous,CC-0,55,upper extremity,benign,,False,,nevus,,,dermoscopic,,True,,,,female
ISIC_0000193,Anonymous,CC-0,55,upper extremity,benign,,False,,nevus,,,dermoscopic,,True,,,,female
ISIC_0000195,Anonymous,CC-0,15,anterior torso,benign,,False,,nevus,,,dermoscopic,,True,,,,female
ISIC_0000196,Anonymous,CC-0,10,lower extremity,benign,,False,,nevus,,,dermoscopic,,True,,,,female
ISIC_0000197,Anonymous,CC-0,10,lower extremity,benign,,False,,nevus,,,dermoscopic,,True,,,,female
ISIC_0000198,Anonymous,CC-0,65,lower extremity,benign,,False,,nevus,,,dermoscopic,,True,,,,male
ISIC_0000199,Anonymous,CC-0,20,upper extremity,benign,,False,,nevus,,,dermoscopic,,True,,,,male
ISIC_0000200,Anonymous,CC-0,50,lower extremity,benign,,False,,nevus,,,dermoscopic,,True,,,,female
ISIC_0000201,Anonymous,CC-0,15,lower extremity,benign,,False,,nevus,,,dermoscopic,,True,,,,male
ISIC_0000202,Anonymous,CC-0,25,posterior torso,benign,,False,,nevus,,,dermoscopic,,True,,,,female
ISIC_0000203,Anonymous,CC-0,45,posterior torso,benign,,False,,nevus,,,dermoscopic,,True,,,,female
ISIC_0000204,Anonymous,CC-0,45,posterior torso,benign,,False,,nevus,,,dermoscopic,,True,,,,male
ISIC_0000205,Anonymous,CC-0,50,posterior torso,benign,,False,,nevus,,,dermoscopic,,True,,,,male
ISIC_0000206,Anonymous,CC-0,80,lower extremity,benign,,False,,nevus,,,dermoscopic,,True,,,,female
ISIC_0000207,Anonymous,CC-0,30,upper extremity,benign,,False,,nevus,,,dermoscopic,,True,,,,male
ISIC_0000208,Anonymous,CC-0,35,posterior torso,benign,,False,,nevus,,,dermoscopic,,True,,,,male
ISIC_0000209,Anonymous,CC-0,75,upper extremity,benign,,False,,nevus,,,dermoscopic,,True,,,,female
ISIC_0000210,Anonymous,CC-0,65,lower extremity,benign,,False,,nevus,,,dermoscopic,,True,,,,male
ISIC_0000211,Anonymous,CC-0,30,upper extremity,benign,,False,,nevus,,,dermoscopic,,True,,,,female
ISIC_0000212,Anonymous,CC-0,25,posterior torso,benign,,False,,nevus,,,dermoscopic,,True,,,,female
ISIC_0000213,Anonymous,CC-0,30,anterior torso,benign,,False,,nevus,,,dermoscopic,,True,,,,female
ISIC_0000214,Anonymous,CC-0,65,posterior torso,benign,,False,,nevus,,,dermoscopic,,True,,,,male
ISIC_0000215,Anonymous,CC-0,45,anterior torso,benign,,False,,nevus,,,dermoscopic,,True,,,,male
ISIC_0000216,Anonymous,CC-0,30,anterior torso,benign,,False,,nevus,,,dermoscopic,,True,,,,male
ISIC_0000217,Anonymous,CC-0,70,lower extremity,benign,,False,,nevus,,,dermoscopic,,True,,,,male
ISIC_0000218,Anonymous,CC-0,55,posterior torso,benign,,False,,nevus,,,dermoscopic,,True,,,,male
ISIC_0000219,Anonymous,CC-0,35,lower extremity,benign,,False,,nevus,,,dermoscopic,,True,,,,male
ISIC_0000220,Anonymous,CC-0,30,lower extremity,benign,,False,,nevus,,,dermoscopic,,True,,,,female
ISIC_0000221,Anonymous,CC-0,30,upper extremity,benign,,False,,nevus,,,dermoscopic,,True,,,,female
ISIC_0000222,Anonymous,CC-0,25,lower extremity,benign,,False,,nevus,,,dermoscopic,,True,,,,female
ISIC_0000223,Anonymous,CC-0,45,anterior torso,benign,,False,,nevus,,,dermoscopic,,True,,,,female
ISIC_0000224,Anonymous,CC-0,20,anterior torso,benign,,False,,nevus,,,dermoscopic,,True,,,,female
ISIC_0000225,Anonymous,CC-0,35,anterior torso,benign,,False,,nevus,,,dermoscopic,,True,,,,female
ISIC_0000226,Anonymous,CC-0,70,posterior torso,benign,,False,,nevus,,,dermoscopic,,True,,,,male
ISIC_0000227,Anonymous,CC-0,40,lower extremity,benign,,False,,nevus,,,dermoscopic,,True,,,,female
ISIC_0000228,Anonymous,CC-0,30,anterior torso,benign,,False,,nevus,,,dermoscopic,,True,,,,female
ISIC_0000229,Anonymous,CC-0,50,anterior torso,benign,,False,,nevus,,,dermoscopic,,True,,,,male
ISIC_0000230,Anonymous,CC-0,20,anterior torso,benign,,False,,nevus,,,dermoscopic,,True,,,,female
ISIC_0000231,Anonymous,CC-0,25,posterior torso,benign,,False,,nevus,,,dermoscopic,,True,,,,female
ISIC_0000232,Anonymous,CC-0,75,upper extremity,benign,,False,,nevus,,,dermoscopic,,True,,,,male
ISIC_0000233,Anonymous,CC-0,60,anterior torso,benign,,False,,nevus,,,dermoscopic,,True,,,,female
ISIC_0000234,Anonymous,CC-0,20,anterior torso,benign,,False,,nevus,,,dermoscopic,,True,,,,male
ISIC_0000235,Anonymous,CC-0,10,lower extremity,benign,,False,,nevus,,,dermoscopic,,True,,,,female
ISIC_0000236,Anonymous,CC-0,30,lower extremity,benign,,False,,nevus,,,dermoscopic,,True,,,,male
ISIC_0000237,Anonymous,CC-0,70,posterior torso,benign,,False,,nevus,,,dermoscopic,,True,,,,male
ISIC_0000239,Anonymous,CC-0,5,lower extremity,benign,,False,,nevus,,,dermoscopic,,True,,,,female
ISIC_0000240,Anonymous,CC-0,35,posterior torso,benign,,False,,nevus,,,dermoscopic,,True,,,,female
ISIC_0000242,Anonymous,CC-0,60,lateral torso,benign,,False,,nevus,,,dermoscopic,,True,,,,male
ISIC_0000243,Anonymous,CC-0,65,posterior torso,benign,,False,,nevus,,,dermoscopic,,True,,,,male
ISIC_0000244,Anonymous,CC-0,40,anterior torso,benign,,False,,nevus,,,dermoscopic,,True,,,,male
ISIC_0000245,Anonymous,CC-0,70,posterior torso,benign,,False,,nevus,,,dermoscopic,,True,,,,male
ISIC_0000246,Anonymous,CC-0,25,lower extremity,benign,,False,,nevus,,,dermoscopic,,True,,,,female
ISIC_0000247,Anonymous,CC-0,35,upper extremity,benign,,False,,nevus,,,dermoscopic,,True,,,,male
ISIC_0000249,Anonymous,CC-0,20,lower extremity,benign,,False,,nevus,,,dermoscopic,,True,,,,female
ISIC_0000250,Anonymous,CC-0,35,anterior torso,benign,,False,,nevus,,,dermoscopic,,True,,,,male
ISIC_0000251,Anonymous,CC-0,50,posterior torso,benign,,False,,nevus,,,dermoscopic,,True,,,,female
ISIC_0000252,Anonymous,CC-0,75,lower extremity,benign,,False,,nevus,,,dermoscopic,,True,,,,male
ISIC_0000253,Anonymous,CC-0,30,posterior torso,benign,,False,,nevus,,,dermoscopic,,True,,,,female
ISIC_0000254,Anonymous,CC-0,60,lower extremity,benign,,False,,nevus,,,dermoscopic,,True,,,,female
ISIC_0000255,Anonymous,CC-0,60,lower extremity,benign,,False,,nevus,,,dermoscopic,,True,,,,female
ISIC_0000256,Anonymous,CC-0,65,posterior torso,benign,,False,,nevus,,,dermoscopic,,True,,,,male
ISIC_0000258,Anonymous,CC-0,70,posterior torso,benign,,False,,nevus,,,dermoscopic,,True,,,,male
ISIC_0000259,Anonymous,CC-0,45,anterior torso,benign,,False,,nevus,,,dermoscopic,,True,,,,female
ISIC_0000260,Anonymous,CC-0,10,posterior torso,benign,,False,,nevus,,,dermoscopic,,True,,,,male
ISIC_0000261,Anonymous,CC-0,30,upper extremity,benign,,False,,nevus,,,dermoscopic,,True,,,,female
ISIC_0000262,Anonymous,CC-0,25,anterior torso,benign,,False,,nevus,,,dermoscopic,,True,,,,female
ISIC_0000263,Anonymous,CC-0,25,posterior torso,benign,,False,,nevus,,,dermoscopic,,True,,,,female
ISIC_0000264,Anonymous,CC-0,25,lower extremity,benign,,False,,nevus,,,dermoscopic,,True,,,,female
ISIC_0000265,Anonymous,CC-0,25,upper extremity,benign,,False,,nevus,,,dermoscopic,,True,,,,female