isic_id,attribution,copyright_license,age_approx,anatom_site_general,benign_malignant,concomitant_biopsy,diagnosis,diagnosis_confirm_type,image_type,lesion_id,melanocytic,sex
ISIC_0034524,"ViDIR Group, Department of Dermatology, Medical University of Vienna",CC-BY-NC,40,posterior torso,benign,False,nevus,serial imaging showing no change,dermoscopic,IL_8028413,True,female
ISIC_0034525,"ViDIR Group, Department of Dermatology, Medical University of Vienna",CC-BY-NC,70,anterior torso,benign,True,nevus,histopathology,dermoscopic,IL_8912554,True,male
ISIC_0034526,"ViDIR Group, Department of Dermatology, Medical University of Vienna",CC-BY-NC,70,posterior torso,,True,pigmented benign keratosis,histopathology,dermoscopic,IL_6864775,False,male
ISIC_0034527,"ViDIR Group, Department of Dermatology, Medical University of Vienna",CC-BY-NC,35,,benign,True,nevus,histopathology,dermoscopic,IL_5458422,True,male
ISIC_0034528,"ViDIR Group, Department of Dermatology, Medical University of Vienna",CC-BY-NC,75,,benign,False,nevus,serial imaging showing no change,dermoscopic,IL_8946723,True,female
ISIC_0034529,"ViDIR Group, Department of Dermatology, Medical University of Vienna",CC-BY-NC,,,malignant,True,melanoma,histopathology,dermoscopic,IL_3513019,True,
ISIC_0034530,"ViDIR Group, Department of Dermatology, Medical University of Vienna",CC-BY-NC,45,lower extremity,benign,False,nevus,serial imaging showing no change,dermoscopic,IL_8352903,True,male
ISIC_0034531,"ViDIR Group, Department of Dermatology, Medical University of Vienna",CC-BY-NC,70,posterior torso,,True,pigmented benign keratosis,histopathology,dermoscopic,IL_1477377,False,male
ISIC_0034532,"ViDIR Group, Department of Dermatology, Medical University of Vienna",CC-BY-NC,40,upper extremity,benign,False,nevus,serial imaging showing no change,dermoscopic,IL_7234784,True,female
ISIC_0034533,"ViDIR Group, Department of Dermatology, Medical University of Vienna",CC-BY-NC,55,anterior torso,benign,False,nevus,serial imaging showing no change,dermoscopic,IL_0713360,True,male
ISIC_0034534,"ViDIR Group, Department of Dermatology, Medical University of Vienna",CC-BY-NC,45,,benign,False,nevus,serial imaging showing no change,dermoscopic,IL_5598970,True,male
ISIC_0034535,"ViDIR Group, Department of Dermatology, Medical University of Vienna",CC-BY-NC,,,,False,pigmented benign keratosis,single image expert consensus,dermoscopic,IL_9369418,False,
ISIC_0034536,"ViDIR Group, Department of Dermatology, Medical University of Vienna",CC-BY-NC,70,head/neck,,True,squamous cell carcinoma,histopathology,dermoscopic,IL_5921524,False,female
ISIC_0034537,"ViDIR Group, Department of Dermatology, Medical University of Vienna",CC-BY-NC,45,anterior torso,benign,True,nevus,histopathology,dermoscopic,IL_4572790,True,female
ISIC_0034538,"ViDIR Group, Department of Dermatology, Medical University of Vienna",CC-BY-NC,50,head/neck,,True,actinic keratosis,histopathology,dermoscopic,IL_4896087,False,male
ISIC_0034539,"ViDIR Group, Department of Dermatology, Medical University of Vienna",CC-BY-NC,75,posterior torso,,True,pigmented benign keratosis,histopathology,dermoscopic,IL_5564856,False,male
ISIC_0034540,"ViDIR Group, Department of Dermatology, Medical University of Vienna",CC-BY-NC,,,benign,False,nevus,single image expert consensus,dermoscopic,IL_0771130,True,
ISIC_0034541,"ViDIR Group, Department of Dermatology, Medical University of Vienna",CC-BY-NC,40,lower extremity,benign,False,nevus,serial imaging showing no change,dermoscopic,IL_1761643,True,female
ISIC_0034542,"ViDIR Group, Department of Dermatology, Medical University of Vienna",CC-BY-NC,,,,False,pigmented benign keratosis,single image expert consensus,dermoscopic,IL_0343676,False,
ISIC_0034543,"ViDIR Group, Department of Dermatology, Medical University of Vienna",CC-BY-NC,45,,benign,False,nevus,serial imaging showing no change,dermoscopic,IL_8794897,True,female
ISIC_0034544,"ViDIR Group, Department of Dermatology, Medical University of Vienna",CC-BY-NC,20,anterior torso,benign,True,nevus,histopathology,dermoscopic,IL_0786469,True,female
ISIC_0034545,"ViDIR Group, Department of Dermatology, Medical University of Vienna",CC-BY-NC,50,upper extremity,,True,basal cell carcinoma,histopathology,dermoscopic,IL_5643065,False,female
ISIC_0034546,"ViDIR Group, Department of Dermatology, Medical University of Vienna",CC-BY-NC,70,posterior torso,,False,pigmented benign keratosis,single image expert consensus,dermoscopic,IL_2002113,False,male
ISIC_0034547,"ViDIR Group, Department of Dermatology, Medical University of Vienna",CC-BY-NC,85,posterior torso,,True,pigmented benign keratosis,histopathology,dermoscopic,IL_7238806,False,male
ISIC_0034548,"ViDIR Group, Department of Dermatology, Medical University of Vienna",CC-BY-NC,60,head/neck,malignant,True,melanoma,histopathology,dermoscopic,IL_0064712,True,male
ISIC_0034549,"ViDIR Group, Department of Dermatology, Medical University of Vienna",CC-BY-NC,,,,True,vascular lesion,histopathology,dermoscopic,IL_6097514,False,
ISIC_0034551,"ViDIR Group, Department of Dermatology, Medical University of Vienna",CC-BY-NC,45,upper extremity,benign,False,nevus,serial imaging showing no change,dermoscopic,IL_1006068,True,male
ISIC_0034552,"ViDIR Group, Department of Dermatology, Medical University of Vienna",CC-BY-NC,70,posterior torso,benign,True,nevus,histopathology,dermoscopic,IL_9199063,True,female
ISIC_0034553,"ViDIR Group, Department of Dermatology, Medical University of Vienna",CC-BY-NC,60,anterior torso,benign,False,nevus,serial imaging showing no change,dermoscopic,IL_2842157,True,male
ISIC_0034554,"ViDIR Group, Department of Dermatology, Medical University of Vienna",CC-BY-NC,85,posterior torso,,True,basal cell carcinoma,histopathology,dermoscopic,IL_2986546,False,male
ISIC_0034555,"ViDIR Group, Department of Dermatology, Medical University of Vienna",CC-BY-NC,75,anterior torso,,False,vascular lesion,single image expert consensus,dermoscopic,IL_8100813,False,male
ISIC_0034556,"ViDIR Group, Department of Dermatology, Medical University of Vienna",CC-BY-NC,35,posterior torso,benign,False,nevus,serial imaging showing no change,dermoscopic,IL_5782784,True,male
ISIC_0034557,"ViDIR Group, Department of Dermatology, Medical University of Vienna",CC-BY-NC,40,lower extremity,benign,False,nevus,serial imaging showing no change,dermoscopic,IL_9903509,True,female
ISIC_0034558,"ViDIR Group, Department of Dermatology, Medical University of Vienna",CC-BY-NC,55,anterior torso,benign,True,nevus,histopathology,dermoscopic,IL_5311695,True,female
ISIC_0034559,"ViDIR Group, Department of Dermatology, Medical University of Vienna",CC-BY-NC,50,posterior torso,benign,False,nevus,serial imaging showing no change,dermoscopic,IL_5026919,True,female
ISIC_0034560,"ViDIR Group, Department of Dermatology, Medical University of Vienna",CC-BY-NC,40,lower extremity,benign,False,nevus,serial imaging showing no change,dermoscopic,IL_9630394,True,female
ISIC_0034561,"ViDIR Group, Department of Dermatology, Medical University of Vienna",CC-BY-NC,65,head/neck,,False,pigmented benign keratosis,confocal microscopy with consensus dermoscopy,dermoscopic,IL_4495226,False,male
ISIC_0034562,"ViDIR Group, Department of Dermatology, Medical University of Vienna",CC-BY-NC,40,lower extremity,benign,False,nevus,serial imaging showing no change,dermoscopic,IL_7987816,True,female
ISIC_0034563,"ViDIR Group, Department of Dermatology, Medical University of Vienna",CC-BY-NC,45,posterior torso,benign,False,nevus,serial imaging showing no change,dermoscopic,IL_1349759,True,male
ISIC_0034564,"ViDIR Group, Department of Dermatology, Medical University of Vienna",CC-BY-NC,45,anterior torso,benign,False,nevus,serial imaging showing no change,dermoscopic,IL_7066222,True,female
ISIC_0034565,"ViDIR Group, Department of Dermatology, Medical University of Vienna",CC-BY-NC,65,anterior torso,,True,basal cell carcinoma,histopathology,dermoscopic,IL_3102684,False,male
ISIC_0034566,"ViDIR Group, Department of Dermatology, Medical University of Vienna",CC-BY-NC,45,lower extremity,benign,False,nevus,serial imaging showing no change,dermoscopic,IL_0228020,True,female
ISIC_0034567,"ViDIR Group, Department of Dermatology, Medical University of Vienna",CC-BY-NC,45,posterior torso,benign,False,nevus,serial imaging showing no change,dermoscopic,IL_3570548,True,male
ISIC_0034568,"ViDIR Group, Department of Dermatology, Medical University of Vienna",CC-BY-NC,50,upper extremity,benign,False,nevus,serial imaging showing no change,dermoscopic,IL_3414422,True,male
ISIC_0034569,"ViDIR Group, Department of Dermatology, Medical University of Vienna",CC-BY-NC,,,benign,True,nevus,histopathology,dermoscopic,IL_6253713,True,
ISIC_0034570,"ViDIR Group, Department of Dermatology, Medical University of Vienna",CC-BY-NC,75,lower extremity,,True,pigmented benign keratosis,histopathology,dermoscopic,IL_3557128,False,female
ISIC_0034571,"ViDIR Group, Department of Dermatology, Medical University of Vienna",CC-BY-NC,,,,False,pigmented benign keratosis,single image expert consensus,dermoscopic,IL_2140686,False,
ISIC_0034572,"ViDIR Group, Department of Dermatology, Medical University of Vienna",CC-BY-NC,55,anterior torso,malignant,True,melanoma,histopathology,dermoscopic,IL_7728515,True,male
ISIC_0034573,"ViDIR Group, Department of Dermatology, Medical University of Vienna",CC-BY-NC,,,malignant,True,melanoma,histopathology,dermoscopic,IL_2608936,True,
ISIC_0034574,"ViDIR Group, Department of Dermatology, Medical University of Vienna",CC-BY-NC,65,posterior torso,,True,pigmented benign keratosis,histopathology,dermoscopic,IL_2229636,False,female
ISIC_0034575,"ViDIR Group, Department of Dermatology, Medical University of Vienna",CC-BY-NC,,,,False,pigmented benign keratosis,single image expert consensus,dermoscopic,IL_1093912,False,
ISIC_0034576,"ViDIR Group, Department of Dermatology, Medical University of Vienna",CC-BY-NC,45,,benign,False,nevus,serial imaging showing no change,dermoscopic,IL_3764797,True,female
ISIC_0034577,"ViDIR Group, Department of Dermatology, Medical University of Vienna",CC-BY-NC,35,lower extremity,benign,True,nevus,histopathology,dermoscopic,IL_2163456,True,female
ISIC_0034578,"ViDIR Group, Department of Dermatology, Medical University of Vienna",CC-BY-NC,75,posterior torso,,True,pigmented benign keratosis,histopathology,dermoscopic,IL_9094161,False,male
ISIC_0034579,"ViDIR Group, Department of Dermatology, Medical University of Vienna",CC-BY-NC,45,upper extremity,,True,squamous cell carcinoma,histopathology,dermoscopic,IL_0850142,False,female
ISIC_0034580,"ViDIR Group, Department of Dermatology, Medical University of Vienna",CC-BY-NC,25,,benign,False,nevus,single image expert consensus,dermoscopic,IL_3536876,True,
ISIC_0034581,"ViDIR Group, Department of Dermatology, Medical University of Vienna",CC-BY-NC,45,lower extremity,benign,False,nevus,serial imaging showing no change,dermoscopic,IL_7996572,True,male
ISIC_0034582,"ViDIR Group, Department of Dermatology, Medical University of Vienna",CC-BY-NC,35,upper extremity,benign,False,nevus,serial imaging showing no change,dermoscopic,IL_3121824,True,female
ISIC_0034583,"ViDIR Group, Department of Dermatology, Medical University of Vienna",CC-BY-NC,50,lower extremity,benign,True,nevus,histopathology,dermoscopic,IL_6528772,True,female
ISIC_0034584,"ViDIR Group, Department of Dermatology, Medical University of Vienna",CC-BY-NC,60,posterior torso,malignant,True,melanoma,histopathology,dermoscopic,IL_4528445,True,male
ISIC_0034585,"ViDIR Group, Department of Dermatology, Medical University of Vienna",CC-BY-NC,65,posterior torso,,True,squamous cell carcinoma,histopathology,dermoscopic,IL_0395327,False,male
ISIC_0034586,"ViDIR Group, Department of Dermatology, Medical University of Vienna",CC-BY-NC,25,posterior torso,benign,True,nevus,histopathology,dermoscopic,IL_4370701,True,female
ISIC_0034587,"ViDIR Group, Department of Dermatology, Medical University of Vienna",CC-BY-NC,55,,benign,False,nevus,serial imaging showing no change,dermoscopic,IL_7091545,True,female
ISIC_0034588,"ViDIR Group, Department of Dermatology, Medical University of Vienna",CC-BY-NC,80,posterior torso,,True,basal cell carcinoma,histopathology,dermoscopic,IL_9099494,False,male
ISIC_0034589,"ViDIR Group, Department of Dermatology, Medical University of Vienna",CC-BY-NC,45,lower extremity,benign,False,nevus,serial imaging showing no change,dermoscopic,IL_1521391,True,male
ISIC_0034590,"ViDIR Group, Department of Dermatology, Medical University of Vienna",CC-BY-NC,55,posterior torso,benign,True,nevus,histopathology,dermoscopic,IL_2188746,True,female
ISIC_0034591,"ViDIR Group, Department of Dermatology, Medical University of Vienna",CC-BY-NC,70,head/neck,,True,pigmented benign keratosis,histopathology,dermoscopic,IL_3901287,False,female
ISIC_0034592,"ViDIR Group, Department of Dermatology, Medical University of Vienna",CC-BY-NC,40,,benign,False,nevus,serial imaging showing no change,dermoscopic,IL_2808244,True,male
ISIC_0034593,"ViDIR Group, Department of Dermatology, Medical University of Vienna",CC-BY-NC,35,,benign,False,nevus,serial imaging showing no change,dermoscopic,IL_5113316,True,male
ISIC_0034594,"ViDIR Group, Department of Dermatology, Medical University of Vienna",CC-BY-NC,60,lower extremity,benign,False,nevus,serial imaging showing no change,dermoscopic,IL_2191298,True,male
ISIC_0034595,"ViDIR Group, Department of Dermatology, Medical University of Vienna",CC-BY-NC,70,upper extremity,malignant,True,melanoma,histopathology,dermoscopic,IL_1837583,True,female
ISIC_0034596,"ViDIR Group, Department of Dermatology, Medical University of Vienna",CC-BY-NC,75,posterior torso,,True,pigmented benign keratosis,histopathology,dermoscopic,IL_5564856,False,male
ISIC_0034597,"ViDIR Group, Department of Dermatology, Medical University of Vienna",CC-BY-NC,60,upper extremity,,True,dermatofibroma,histopathology,dermoscopic,IL_0522964,False,female
ISIC_0034598,"ViDIR Group, Department of Dermatology, Medical University of Vienna",CC-BY-NC,60,posterior torso,,True,basal cell carcinoma,histopathology,dermoscopic,IL_3377512,False,male
ISIC_0034599,"ViDIR Group, Department of Dermatology, Medical University of Vienna",CC-BY-NC,,lower extremity,benign,False,nevus,single image expert consensus,dermoscopic,IL_9130306,True,female
ISIC_0034600,"ViDIR Group, Department of Dermatology, Medical University of Vienna",CC-BY-NC,40,lower extremity,benign,False,nevus,serial imaging showing no change,dermoscopic,IL_8502285,True,male
ISIC_0034601,"ViDIR Group, Department of Dermatology, Medical University of Vienna",CC-BY-NC,50,anterior torso,benign,False,nevus,serial imaging showing no change,dermoscopic,IL_9945266,True,female
ISIC_0034602,"ViDIR Group, Department of Dermatology, Medical University of Vienna",CC-BY-NC,55,,benign,False,nevus,serial imaging showing no change,dermoscopic,IL_2786826,True,male
ISIC_0034603,"ViDIR Group, Department of Dermatology, Medical University of Vienna",CC-BY-NC,25,upper extremity,benign,True,nevus,histopathology,dermoscopic,IL_2590250,True,female
ISIC_0034604,"ViDIR Group, Department of Dermatology, Medical University of Vienna",CC-BY-NC,65,anterior torso,benign,False,nevus,serial imaging showing no change,dermoscopic,IL_9967672,True,male
ISIC_0034605,"ViDIR Group, Department of Dermatology, Medical University of Vienna",CC-BY-NC,75,posterior torso,malignant,True,melanoma,histopathology,dermoscopic,IL_1313133,True,male
ISIC_0034606,"ViDIR Group, Department of Dermatology, Medical University of Vienna",CC-BY-NC,,,,True,basal cell carcinoma,histopathology,dermoscopic,IL_9842802,False,
ISIC_0034607,"ViDIR Group, Department of Dermatology, Medical University of Vienna",CC-BY-NC,40,lower extremity,benign,False,nevus,serial imaging showing no change,dermoscopic,IL_4237905,True,female
ISIC_0034608,"ViDIR Group, Department of Dermatology, Medical University of Vienna",CC-BY-NC,55,anterior torso,,False,vascular lesion,single image expert consensus,dermoscopic,IL_1461675,False,male
ISIC_0034609,"ViDIR Group, Department of Dermatology, Medical University of Vienna",CC-BY-NC,20,head/neck,benign,False,nevus,serial imaging showing no change,dermoscopic,IL_1979873,True,male
ISIC_0034610,"ViDIR Group, Department of Dermatology, Medical University of Vienna",CC-BY-NC,55,lower extremity,benign,False,nevus,serial imaging showing no change,dermoscopic,IL_2274336,True,female
ISIC_0034611,"ViDIR Group, Department of Dermatology, Medical University of Vienna",CC-BY-NC,25,anterior torso,benign,False,nevus,serial imaging showing no change,dermoscopic,IL_4000091,True,male
ISIC_0034612,"ViDIR Group, Department of Dermatology, Medical University of Vienna",CC-BY-NC,55,head/neck,,True,basal cell carcinoma,histopathology,dermoscopic,IL_4674217,False,female
ISIC_0034613,"ViDIR Group, Department of Dermatology, Medical University of Vienna",CC-BY-NC,,,benign,False,nevus,single image expert consensus,dermoscopic,IL_1954678,True,
ISIC_0034614,"ViDIR Group, Department of Dermatology, Medical University of Vienna",CC-BY-NC,70,head/neck,,False,pigmented benign keratosis,single image expert consensus,dermoscopic,IL_9409153,False,female
ISIC_0034615,"ViDIR Group, Department of Dermatology, Medical University of Vienna",CC-BY-NC,80,head/neck,,True,pigmented benign keratosis,histopathology,dermoscopic,IL_1131460,False,male
ISIC_0034616,"ViDIR Group, Department of Dermatology, Medical University of Vienna",CC-BY-NC,65,lower extremity,benign,False,nevus,serial imaging showing no change,dermoscopic,IL_7661279,True,female
ISIC_0034617,"ViDIR Group, Department of Dermatology, Medical University of Vienna",CC-BY-NC,45,posterior torso,benign,True,nevus,histopathology,dermoscopic,IL_8739695,True,female
ISIC_0034618,"ViDIR Group, Department of Dermatology, Medical University of Vienna",CC-BY-NC,55,head/neck,,True,pigmented benign keratosis,histopathology,dermoscopic,IL_5600403,False,male
ISIC_0034619,"ViDIR Group, Department of Dermatology, Medical University of Vienna",CC-BY-NC,40,upper extremity,benign,False,nevus,serial imaging showing no change,dermoscopic,IL_4029744,True,female
ISIC_0034620,"ViDIR Group, Department of Dermatology, Medical University of Vienna",CC-BY-NC,45,lower extremity,benign,False,nevus,serial imaging showing no change,dermoscopic,IL_8751116,True,male
ISIC_0034621,"ViDIR Group, Department of Dermatology, Medical University of Vienna",CC-BY-NC,30,posterior torso,benign,True,nevus,histopathology,dermoscopic,IL_7585854,True,male
ISIC_0034622,"ViDIR Group, Department of Dermatology, Medical University of Vienna",CC-BY-NC,,,,False,pigmented benign keratosis,single image expert consensus,dermoscopic,IL_8027060,False,
ISIC_0034623,"ViDIR Group, Department of Dermatology, Medical University of Vienna",CC-BY-NC,45,lower extremity,benign,False,nevus,serial imaging showing no change,dermoscopic,IL_1594599,True,male
ISIC_0034624,"ViDIR Group, Department of Dermatology, Medical University of Vienna",CC-BY-NC,40,upper extremity,benign,False,nevus,serial imaging showing no change,dermoscopic,IL_7001712,True,male
ISIC_0034625,"ViDIR Group, Department of Dermatology, Medical University of Vienna",CC-BY-NC,35,anterior torso,benign,False,nevus,serial imaging showing no change,dermoscopic,IL_8637077,True,female
ISIC_0034626,"ViDIR Group, Department of Dermatology, Medical University of Vienna",CC-BY-NC,45,lower extremity,benign,False,nevus,serial imaging showing no change,dermoscopic,IL_1936271,True,male
ISIC_0034627,"ViDIR Group, Department of Dermatology, Medical University of Vienna",CC-BY-NC,25,anterior torso,benign,False,nevus,single image expert consensus,dermoscopic,IL_1029171,True,female
ISIC_0034628,"ViDIR Group, Department of Dermatology, Medical University of Vienna",CC-BY-NC,75,posterior torso,malignant,True,melanoma,histopathology,dermoscopic,IL_6545358,True,male
ISIC_0034629,"ViDIR Group, Department of Dermatology, Medical University of Vienna",CC-BY-NC,45,anterior torso,benign,True,nevus,histopathology,dermoscopic,IL_8040347,True,male
ISIC_0034630,"ViDIR Group, Department of Dermatology, Medical University of Vienna",CC-BY-NC,50,lower extremity,malignant,True,melanoma,histopathology,dermoscopic,IL_1546321,True,female
ISIC_0034631,"ViDIR Group, Department of Dermatology, Medical University of Vienna",CC-BY-NC,,,,False,pigmented benign keratosis,single image expert consensus,dermoscopic,IL_7563140,False,
ISIC_0034632,"ViDIR Group, Department of Dermatology, Medical University of Vienna",CC-BY-NC,65,lower extremity,benign,True,nevus,histopathology,dermoscopic,IL_9436775,True,female
ISIC_0034633,"ViDIR Group, Department of Dermatology, Medical University of Vienna",CC-BY-NC,50,posterior torso,malignant,True,melanoma,histopathology,dermoscopic,IL_7650222,True,male
ISIC_0034634,"ViDIR Group, Department of Dermatology, Medical University of Vienna",CC-BY-NC,55,,benign,False,nevus,serial imaging showing no change,dermoscopic,IL_5214806,True,male
ISIC_0034635,"ViDIR Group, Department of Dermatology, Medical University of Vienna",CC-BY-NC,50,head/neck,benign,True,nevus,histopathology,dermoscopic,IL_5493940,True,male
ISIC_0034636,"ViDIR Group, Department of Dermatology, Medical University of Vienna",CC-BY-NC,45,anterior torso,benign,False,nevus,serial imaging showing no change,dermoscopic,IL_3005516,True,female
ISIC_0034637,"ViDIR Group, Department of Dermatology, Medical University of Vienna",CC-BY-NC,30,upper extremity,benign,True,nevus,histopathology,dermoscopic,IL_8299961,True,female
ISIC_0034638,"ViDIR Group, Department of Dermatology, Medical University of Vienna",CC-BY-NC,70,head/neck,malignant,True,melanoma,histopathology,dermoscopic,IL_4073821,True,female
ISIC_0034639,"ViDIR Group, Department of Dermatology, Medical University of Vienna",CC-BY-NC,40,upper extremity,benign,False,nevus,serial imaging showing no change,dermoscopic,IL_0516815,True,male
ISIC_0034640,"ViDIR Group, Department of Dermatology, Medical University of Vienna",CC-BY-NC,40,,benign,False,nevus,serial imaging showing no change,dermoscopic,IL_2757577,True,female
ISIC_0034641,"ViDIR Group, Department of Dermatology, Medical University of Vienna",CC-BY-NC,45,,benign,False,nevus,serial imaging showing no change,dermoscopic,IL_7561443,True,female
ISIC_0034642,"ViDIR Group, Department of Dermatology, Medical University of Vienna",CC-BY-NC,,,,True,dermatofibroma,histopathology,dermoscopic,IL_3121697,False,
ISIC_0034643,"ViDIR Group, Department of Dermatology, Medical University of Vienna",CC-BY-NC,55,lower extremity,benign,False,nevus,serial imaging showing no change,dermoscopic,IL_3525940,True,male
ISIC_0034644,"ViDIR Group, Department of Dermatology, Medical University of Vienna",CC-BY-NC,60,anterior torso,malignant,True,melanoma,histopathology,dermoscopic,IL_4516882,True,male
ISIC_0034645,"ViDIR Group, Department of Dermatology, Medical University of Vienna",CC-BY-NC,60,,benign,False,nevus,serial imaging showing no change,dermoscopic,IL_2121633,True,male
ISIC_0034646,"ViDIR Group, Department of Dermatology, Medical University of Vienna",CC-BY-NC,,,,False,pigmented benign keratosis,single image expert consensus,dermoscopic,IL_0615215,False,
ISIC_0034648,"ViDIR Group, Department of Dermatology, Medical University of Vienna",CC-BY-NC,55,lower extremity,benign,False,nevus,serial imaging showing no change,dermoscopic,IL_6221296,True,female
ISIC_0034649,"ViDIR Group, Department of Dermatology, Medical University of Vienna",CC-BY-NC,30,posterior torso,benign,False,nevus,serial imaging showing no change,dermoscopic,IL_1222471,True,female
ISIC_0034650,"ViDIR Group, Department of Dermatology, Medical University of Vienna",CC-BY-NC,,,malignant,True,melanoma,histopathology,dermoscopic,IL_0780092,True,