isic_id,attribution,copyright_license,age_approx,anatom_site_general,benign_malignant,concomitant_biopsy,dermoscopic_type,diagnosis,diagnosis_confirm_type,image_type,lesion_id,melanocytic,nevus_type,patient_id,sex
ISIC_0012086,Anonymous,CC-0,30,,,,,,,,,,,,
ISIC_0012092,Anonymous,CC-0,40,,,,,,,,,,,,
ISIC_0012095,Anonymous,CC-0,25,,,,,,,,,,,,
ISIC_0012134,Anonymous,CC-0,75,,,,,,,,,,,,
ISIC_0012136,Anonymous,CC-0,70,,,,,,,,,,,,
ISIC_0012147,Anonymous,CC-0,35,,,,,,,,,,,,
ISIC_0012149,Anonymous,CC-0,10,,,,,,,,,,,,
ISIC_0012152,Anonymous,CC-0,55,,,,,,,,,,,,
ISIC_0012178,Anonymous,CC-0,50,,,,,,,,,,,,
ISIC_0012199,Anonymous,CC-0,70,,,,,,,,,,,,
ISIC_0012207,Anonymous,CC-0,75,,,,,,,,,,,,
ISIC_0012215,Anonymous,CC-0,85,,,,,,,,,,,,
ISIC_0012216,Anonymous,CC-0,45,,,,,,,,,,,,
ISIC_0012223,Anonymous,CC-0,55,,,,,,,,,,,,
ISIC_0012240,Anonymous,CC-0,70,,,,,,,,,,,,
ISIC_0012248,Anonymous,CC-0,70,,,,,,,,,,,,
ISIC_0012258,Anonymous,CC-0,55,,,,,,,,,,,,
ISIC_0012265,Anonymous,CC-0,75,,,,,,,,,,,,
ISIC_0012266,Anonymous,CC-0,60,,,,,,,,,,,,
ISIC_0012272,Anonymous,CC-0,45,,,,,,,,,,,,
ISIC_0012273,Anonymous,CC-0,65,,,,,,,,,,,,
ISIC_0012314,Anonymous,CC-0,60,,,,,,,,,,,,
ISIC_0012323,Anonymous,CC-0,65,,,,,,,,,,,,
ISIC_0012330,Anonymous,CC-0,75,,,,,,,,,,,,
ISIC_0012356,Anonymous,CC-0,70,,,,,,,,,,,,
ISIC_0012357,Anonymous,CC-0,45,,,,,,,,,,,,
ISIC_0012358,Anonymous,CC-0,45,,,,,,,,,,,,
ISIC_0012364,Anonymous,CC-0,60,,,,,,,,,,,,
ISIC_0012369,Anonymous,CC-0,55,,,,,,,,,,,,
ISIC_0012372,Anonymous,CC-0,65,,,,,,,,,,,,
ISIC_0012375,Anonymous,CC-0,55,,,,,,,,,,,,
ISIC_0012387,Anonymous,CC-0,65,,,,,,,,,,,,
ISIC_0012388,Anonymous,CC-0,60,,,,,,,,,,,,
ISIC_0012395,Anonymous,CC-0,50,,,,,,,,,,,,
ISIC_0012414,Anonymous,CC-0,70,,,,,,,,,,,,
ISIC_0012425,Anonymous,CC-0,50,,,,,,,,,,,,
ISIC_0012428,Anonymous,CC-0,45,,,,,,,,,,,,
ISIC_0012432,Anonymous,CC-0,50,,,,,,,,,,,,
ISIC_0012447,Anonymous,CC-0,50,,,,,,,,,,,,
ISIC_0012448,Anonymous,CC-0,55,,,,,,,,,,,,
ISIC_0012484,Anonymous,CC-0,80,,,,,,,,,,,,
ISIC_0012493,Anonymous,CC-0,15,,,,,,,,,,,,
ISIC_0012510,Anonymous,CC-0,60,,,,,,,,,,,,
ISIC_0012522,Anonymous,CC-0,70,,,,,,,,,,,,
ISIC_0012537,Anonymous,CC-0,40,,,,,,,,,,,,
ISIC_0012548,Anonymous,CC-0,35,,,,,,,,,,,,
ISIC_0012551,Anonymous,CC-0,25,,,,,,,,,,,,
ISIC_0012654,Anonymous,CC-0,30,,,,,,,,IL_6236075,,,,
ISIC_0012656,Anonymous,CC-0,45,,,,,,,,IL_0441919,,,,
ISIC_0012705,Anonymous,CC-0,75,,,,,,,,IL_0321967,,,,
ISIC_0012708,Anonymous,CC-0,55,,,,,,,,IL_9054876,,,,
ISIC_0012722,Anonymous,CC-0,70,,,,,,,,IL_9726479,,,,
ISIC_0012757,Anonymous,CC-0,60,,,,,,,,IL_0659394,,,,
ISIC_0012758,Anonymous,CC-0,45,,,,,,,,IL_2714151,,,,
ISIC_0012786,Anonymous,CC-0,75,,,,,,,,IL_9999998,,,,
ISIC_0012803,Anonymous,CC-0,45,,,,,,,,IL_0272494,,,,
ISIC_0012836,Anonymous,CC-0,40,,,,,,,,IL_9882198,,,,
ISIC_0012837,Anonymous,CC-0,80,,,,,,,,IL_5584356,,,,
ISIC_0012848,Anonymous,CC-0,75,,,,,,,,IL_7301389,,,,
ISIC_0012852,Anonymous,CC-0,70,,,,,,,,IL_7322271,,,,
ISIC_0012903,Anonymous,CC-0,60,,,,,,,,IL_9683174,,,,
ISIC_0012904,Anonymous,CC-0,60,,,,,,,,IL_9963756,,,,
ISIC_0012928,Anonymous,CC-0,60,,,,,,,,IL_5717020,,,,
ISIC_0012941,Anonymous,CC-0,65,,,,,,,,IL_1135695,,,,
ISIC_0012955,Anonymous,CC-0,80,,,,,,,,IL_5372520,,,,
ISIC_0012967,Anonymous,CC-0,60,,,,,,,,IL_3566639,,,,
ISIC_0012974,Anonymous,CC-0,50,,,,,,,,IL_2084175,,,,
ISIC_0012989,Anonymous,CC-0,45,,,,,,,,IL_2651385,,,,
ISIC_0013030,Anonymous,CC-0,70,,,,,,,,IL_2617378,,,,
ISIC_0013035,Anonymous,CC-0,75,,,,,,,,IL_3650817,,,,
ISIC_0013045,Anonymous,CC-0,60,,,,,,,,IL_2799440,,,,
ISIC_0013070,Anonymous,CC-0,55,,,,,,,,IL_8281191,,,,
ISIC_0013072,Anonymous,CC-0,70,,,,,,,,IL_5746903,,,,
ISIC_0013073,Anonymous,CC-0,70,,,,,,,,IL_1177515,,,,
ISIC_0013085,Anonymous,CC-0,45,,,,,,,,IL_6531623,,,,
ISIC_0013109,Anonymous,CC-0,50,,,,,,,,IL_5634408,,,,
ISIC_0013159,Anonymous,CC-0,70,,,,,,,,IL_9432313,,,,
ISIC_0013164,Anonymous,CC-0,60,,,,,,,,IL_9623112,,,,
ISIC_0013169,Anonymous,CC-0,80,,,,,,,,IL_6012554,,,,
ISIC_0013170,Anonymous,CC-0,80,,,,,,,,IL_1455015,,,,
ISIC_0013176,Anonymous,CC-0,30,,,,,,,,IL_6421978,,,,
ISIC_0013191,Anonymous,CC-0,50,,,,,,,,IL_3192112,,,,
ISIC_0013203,Anonymous,CC-0,75,,,,,,,,IL_3663340,,,,
ISIC_0013216,Anonymous,CC-0,50,,,,,,,,IL_2038212,,,,
ISIC_0013226,Anonymous,CC-0,35,,,,,,,,IL_6814228,,,,
ISIC_0013230,Anonymous,CC-0,40,,,,,,,,IL_4103716,,,,
ISIC_0013242,Anonymous,CC-0,85,,,,,,,,IL_7145284,,,,
ISIC_0013269,Anonymous,CC-0,45,,,,,,,,IL_4165171,,,,
ISIC_0013270,Anonymous,CC-0,85,,,,,,,,IL_0884302,,,,
ISIC_0013271,Anonymous,CC-0,65,,,,,,,,IL_1900519,,,,
ISIC_0013277,Anonymous,CC-0,70,,,,,,,,IL_6342415,,,,
ISIC_0013281,Anonymous,CC-0,85,,,,,,,,IL_9192074,,,,
ISIC_0013291,Anonymous,CC-0,45,,,,,,,,IL_0644179,,,,
ISIC_0013319,Anonymous,CC-0,75,,,,,,,,IL_6703079,,,,
ISIC_0013321,Anonymous,CC-0,80,,,,,,,,IL_5359572,,,,
ISIC_0013325,Anonymous,CC-0,45,,,,,,,,IL_5877980,,,,
ISIC_0013374,Anonymous,CC-0,85,,,,,,,,IL_8927927,,,,
ISIC_0013393,Anonymous,CC-0,60,,,,,,,,IL_2880605,,,,
ISIC_0013399,Anonymous,CC-0,40,,,,,,,,IL_1236181,,,,
ISIC_0013411,Anonymous,CC-0,70,,,,,,,,IL_7865779,,,,
ISIC_0013414,Anonymous,CC-0,70,,,,,,,,IL_0484940,,,,
ISIC_0013416,Anonymous,CC-0,35,,,,,,,,IL_3739349,,,,
ISIC_0013455,Anonymous,CC-0,80,,,,,,,,IL_5486428,,,,
ISIC_0013457,Anonymous,CC-0,50,,,,,,,,IL_9381946,,,,
ISIC_0013459,Anonymous,CC-0,45,,,,,,,,IL_6545892,,,,
ISIC_0013465,Anonymous,CC-0,75,,,,,,,,IL_6212392,,,,
ISIC_0013472,Anonymous,CC-0,80,,,,,,,,IL_9803020,,,,
ISIC_0013473,Anonymous,CC-0,85,,,,,,,,IL_7065493,,,,
ISIC_0013511,Anonymous,CC-0,70,,,,,,,,IL_9929261,,,,
ISIC_0013512,Anonymous,CC-0,70,,,,,,,,IL_0214706,,,,
ISIC_0013529,Anonymous,CC-0,55,,,,,,,,IL_3629053,,,,
ISIC_0013565,Anonymous,CC-0,75,,,,,,,,IL_5695812,,,,
ISIC_0013577,Anonymous,CC-0,60,,,,,,,,IL_5641693,,,,
ISIC_0013588,Anonymous,CC-0,85,,,,,,,,IL_0482527,,,,
ISIC_0013600,Anonymous,CC-0,80,,,,,,,,IL_7868477,,,,
ISIC_0013602,Anonymous,CC-0,80,,,,,,,,IL_0651854,,,,
ISIC_0013615,Anonymous,CC-0,85,,,,,,,,IL_7473543,,,,
ISIC_0013617,Anonymous,CC-0,60,,,,,,,,IL_0083109,,,,
ISIC_0013636,Anonymous,CC-0,55,,,,,,,,IL_5754771,,,,
ISIC_0013673,Anonymous,CC-0,60,,,,,,,,IL_3999742,,,,
ISIC_0013678,Anonymous,CC-0,55,,,,,,,,IL_9241701,,,,
ISIC_0013696,Anonymous,CC-0,70,,,,,,,,IL_4212417,,,,
ISIC_0013708,Anonymous,CC-0,85,,,,,,,,IL_0490464,,,,
ISIC_0013733,Anonymous,CC-0,75,,,,,,,,IL_9307445,,,,
ISIC_0013738,Anonymous,CC-0,35,,,,,,,,IL_7985229,,,,
ISIC_0013739,Anonymous,CC-0,50,,,,,,,,IL_4726098,,,,
ISIC_0013764,Anonymous,CC-0,65,,,,,,,,IL_7917650,,,,
ISIC_0013766,Anonymous,CC-0,65,,,,,,,,IL_4937597,,,,
ISIC_0013767,Anonymous,CC-0,65,,,,,,,,IL_8255219,,,,
ISIC_0013794,Anonymous,CC-0,45,,,,,,,,IL_0663275,,,,
ISIC_0013809,Anonymous,CC-0,65,,,,,,,,IL_3848273,,,,
ISIC_0013813,Anonymous,CC-0,75,,,,,,,,IL_8143451,,,,
ISIC_0013814,Anonymous,CC-0,75,,,,,,,,IL_8143451,,,,
ISIC_0013833,Anonymous,CC-0,70,,,,,,,,IL_3243721,,,,
ISIC_0013842,Anonymous,CC-0,65,,,,,,,,IL_4960019,,,,
ISIC_0013867,Anonymous,CC-0,75,,,,,,,,IL_2262979,,,,
ISIC_0013891,Anonymous,CC-0,50,,,,,,,,IL_4955569,,,,
ISIC_0013897,Anonymous,CC-0,40,,,,,,,,IL_3301751,,,,
ISIC_0013908,Anonymous,CC-0,75,,,,,,,,IL_2350075,,,,
ISIC_0013911,Anonymous,CC-0,75,,,,,,,,IL_8429560,,,,
ISIC_0013917,Anonymous,CC-0,55,,,,,,,,IL_7795723,,,,
ISIC_0013925,Anonymous,CC-0,75,,,,,,,,IL_2879877,,,,
ISIC_0013948,Anonymous,CC-0,70,,,,,,,,IL_0243404,,,,
ISIC_0013953,Anonymous,CC-0,70,,,,,,,,IL_1021815,,,,
ISIC_0013966,Anonymous,CC-0,65,,,,,,,,IL_1162422,,,,
ISIC_0013977,Anonymous,CC-0,65,,,,,,,,IL_7332899,,,,
ISIC_0013987,Anonymous,CC-0,60,,,,,,,,IL_7068358,,,,
ISIC_0013988,Anonymous,CC-0,60,,,,,,,,IL_1580105,,,,
ISIC_0013998,Anonymous,CC-0,45,,,,,,,,IL_2517924,,,,
ISIC_0014006,Anonymous,CC-0,85,,,,,,,,IL_1846863,,,,
ISIC_0014027,Anonymous,CC-0,55,,,,,,,,IL_7599315,,,,
ISIC_0014059,Anonymous,CC-0,50,,,,,,,,IL_9166804,,,,
ISIC_0014077,Anonymous,CC-0,70,,,,,,,,IL_1121923,,,,
ISIC_0014090,Anonymous,CC-0,65,,,,,,,,IL_1718478,,,,
ISIC_0014103,Anonymous,CC-0,70,,,,,,,,IL_8769321,,,,
ISIC_0014110,Anonymous,CC-0,70,,,,,,,,IL_7154098,,,,
ISIC_0014117,Anonymous,CC-0,45,,,,,,,,IL_8937145,,,,
ISIC_0014129,Anonymous,CC-0,60,,,,,,,,IL_2059892,,,,
ISIC_0014148,Anonymous,CC-0,70,,,,,,,,IL_0509423,,,,
ISIC_0014160,Anonymous,CC-0,55,,,,,,,,IL_2865098,,,,
ISIC_0014177,Anonymous,CC-0,65,,,,,,,,IL_5525557,,,,
ISIC_0014181,Anonymous,CC-0,70,,,,,,,,IL_2429712,,,,
ISIC_0014186,Anonymous,CC-0,75,,,,,,,,IL_5117004,,,,
ISIC_0014219,Anonymous,CC-0,65,,,,,,,,IL_9774088,,,,
ISIC_0014221,Anonymous,CC-0,85,,,,,,,,IL_3939026,,,,
ISIC_0014233,Anonymous,CC-0,80,,,,,,,,IL_5142207,,,,
ISIC_0014251,Anonymous,CC-0,75,,,,,,,,IL_7289875,,,,
ISIC_0014255,Anonymous,CC-0,65,,,,,,,,IL_1742417,,,,
ISIC_0014270,Anonymous,CC-0,85,,,,,,,,IL_2536945,,,,
ISIC_0014278,Anonymous,CC-0,55,,,,,,,,IL_0443028,,,,
ISIC_0014284,Anonymous,CC-0,50,,,,,,,,IL_5076655,,,,
ISIC_0014288,Anonymous,CC-0,65,,,,,,,,IL_7782872,,,,
ISIC_0014319,Anonymous,CC-0,70,,,,,,,,IL_3519536,,,,
ISIC_0014336,Anonymous,CC-0,80,,,,,,,,IL_9254366,,,,
ISIC_0014349,Anonymous,CC-0,80,,,,,,,,IL_2043151,,,,
ISIC_0014369,Anonymous,CC-0,25,,,,,,,,IL_3014234,,,,
ISIC_0014386,Anonymous,CC-0,65,,,,,,,,IL_3712432,,,,
ISIC_0014392,Anonymous,CC-0,55,,,,,,,,IL_4620756,,,,
ISIC_0014409,Anonymous,CC-0,50,,,,,,,,IL_7438809,,,,
ISIC_0014419,Anonymous,CC-0,80,,,,,,,,IL_9690818,,,,
ISIC_0014423,Anonymous,CC-0,80,,,,,,,,IL_2477968,,,,
ISIC_0014434,Anonymous,CC-0,35,,,,,,,,IL_5331384,,,,
ISIC_0014454,Anonymous,CC-0,65,,,,,,,,IL_8437790,,,,
ISIC_0014457,Anonymous,CC-0,75,,,,,,,,IL_9899251,,,,
ISIC_0014470,Anonymous,CC-0,60,,,,,,,,IL_9189379,,,,
ISIC_0014474,Anonymous,CC-0,70,,,,,,,,IL_4425222,,,,
ISIC_0014478,Anonymous,CC-0,65,,,,,,,,IL_8150218,,,,
ISIC_0014489,Anonymous,CC-0,60,,,,,,,,IL_3467881,,,,
ISIC_0014500,Anonymous,CC-0,75,,,,,,,,IL_9155836,,,,
ISIC_0014503,Anonymous,CC-0,50,,,,,,,,IL_4676948,,,,
ISIC_0014506,Anonymous,CC-0,80,,,,,,,,IL_7787789,,,,
ISIC_0014513,Anonymous,CC-0,70,,,,,,,,IL_8564251,,,,
ISIC_0014541,Anonymous,CC-0,70,,,,,,,,IL_4180484,,,,
ISIC_0014542,Anonymous,CC-0,70,,,,,,,,IL_8604445,,,,
ISIC_0014546,Anonymous,CC-0,65,,,,,,,,IL_3716092,,,,
ISIC_0014548,Anonymous,CC-0,65,,,,,,,,IL_5299461,,,,
ISIC_0014559,Anonymous,CC-0,75,,,,,,,,IL_2815432,,,,
ISIC_0014567,Anonymous,CC-0,60,,,,,,,,,,,,
ISIC_0014574,Anonymous,CC-0,60,,,,,,,,,,,,
ISIC_0014575,Anonymous,CC-0,60,,,,,,,,,,,,
ISIC_0014586,Anonymous,CC-0,65,,,,,,,,,,,,
ISIC_0014587,Anonymous,CC-0,60,,,,,,,,,,,,
ISIC_0014588,Anonymous,CC-0,60,,,,,,,,,,,,
ISIC_0014590,Anonymous,CC-0,60,,,,,,,,,,,,
ISIC_0014600,Anonymous,CC-0,80,,,,,,,,,,,,
ISIC_0014619,Anonymous,CC-0,75,,,,,,,,,,,,
ISIC_0014626,Anonymous,CC-0,75,,,,,,,,,,,,
ISIC_0014627,Anonymous,CC-0,75,,,,,,,,,,,,
ISIC_0014629,Anonymous,CC-0,75,,,,,,,,,,,,
ISIC_0014631,Anonymous,CC-0,70,,,,,,,,,,,,
ISIC_0014634,Anonymous,CC-0,70,,,,,,,,,,,,
ISIC_0014643,Anonymous,CC-0,75,,,,,,,,,,,,
ISIC_0014644,Anonymous,CC-0,70,,,,,,,,,,,,
ISIC_0014645,Anonymous,CC-0,70,,,,,,,,,,,,
ISIC_0014647,Anonymous,CC-0,75,,,,,,,,,,,,
ISIC_0014648,Anonymous,CC-0,70,,,,,,,,,,,,
ISIC_0014649,Anonymous,CC-0,70,,,,,,,,,,,,
ISIC_0014652,Anonymous,CC-0,60,,,,,,,,,,,,
ISIC_0014653,Anonymous,CC-0,60,,,,,,,,,,,,
ISIC_0014663,Anonymous,CC-0,85,,,,,,,,IL_5632280,,,IP_4366442,
ISIC_0014666,Anonymous,CC-0,70,,,,,,,,IL_9472033,,,IP_5260515,
ISIC_0014675,Anonymous,CC-0,45,,,,,,,,IL_1380863,,,IP_7813182,
ISIC_0014677,Anonymous,CC-0,50,,,,,,,,IL_3144992,,,IP_6927289,
ISIC_0014687,Anonymous,CC-0,45,,,,,,,,IL_1439049,,,IP_7844475,
ISIC_0014693,Anonymous,CC-0,45,,,,,,,,IL_8798801,,,IP_2073976,
ISIC_0014695,Anonymous,CC-0,40,,,,,,,,IL_8040823,,,IP_2254590,
ISIC_0014697,Anonymous,CC-0,55,,,,,,,,IL_9551395,,,IP_3498415,
ISIC_0014698,Anonymous,CC-0,,,,,,,,,IL_0048051,,,IP_9686963,
ISIC_0014703,Anonymous,CC-0,75,,,,,,,,IL_9558118,,,IP_4028631,
ISIC_0014720,Anonymous,CC-0,30,,,,,,,,IL_7862017,,,IP_1132421,
ISIC_0014725,Anonymous,CC-0,25,,,,,,,,IL_4317832,,,IP_9740614,
ISIC_0014727,Anonymous,CC-0,65,,,,,,,,IL_2174824,,,IP_8355925,
ISIC_0014728,Anonymous,CC-0,,,,,,,,,IL_8262753,,,IP_9345491,
ISIC_0014729,Anonymous,CC-0,50,,,,,,,,IL_8621491,,,IP_7557721,
ISIC_0014740,Anonymous,CC-0,25,,,,,,,,IL_5924115,,,IP_9170032,
ISIC_0014743,Anonymous,CC-0,30,,,,,,,,IL_8888243,,,IP_2041520,
ISIC_0014746,Anonymous,CC-0,25,,,,,,,,IL_1453733,,,IP_2028854,
ISIC_0014749,Anonymous,CC-0,35,,,,,,,,IL_3991931,,,IP_1462966,
ISIC_0014753,Anonymous,CC-0,,,,,,,,,IL_6881218,,,IP_7429058,
ISIC_0014755,Anonymous,CC-0,35,,,,,,,,IL_8654582,,,IP_2648625,
ISIC_0014765,Anonymous,CC-0,40,,,,,,,,IL_1984416,,,IP_2239257,
ISIC_0014766,Anonymous,CC-0,50,,,,,,,,IL_5067418,,,IP_1204192,
ISIC_0014768,Anonymous,CC-0,15,,,,,,,,IL_8705713,,,IP_9660222,
ISIC_0014772,Anonymous,CC-0,75,,,,,,,,IL_1355513,,,IP_4497472,
ISIC_0014773,Anonymous,CC-0,75,,,,,,,,IL_7451075,,,IP_4497472,
ISIC_0014780,Anonymous,CC-0,30,,,,,,,,IL_7739720,,,IP_2399288,
ISIC_0014784,Anonymous,CC-0,45,,,,,,,,IL_0559360,,,IP_2823140,
ISIC_0014786,Anonymous,CC-0,25,,,,,,,,IL_8705945,,,IP_6051563,
ISIC_0014787,Anonymous,CC-0,40,,,,,,,,IL_0577473,,,IP_3146495,
ISIC_0014790,Anonymous,CC-0,85,,,,,,,,IL_8992989,,,IP_5480245,
ISIC_0014792,Anonymous,CC-0,,,,,,,,,IL_1051025,,,IP_0953314,
ISIC_0014796,Anonymous,CC-0,,,,,,,,,IL_4574611,,,IP_9170862,
ISIC_0014798,Anonymous,CC-0,45,,,,,,,,IL_2795643,,,IP_2992403,
ISIC_0014800,Anonymous,CC-0,45,,,,,,,,IL_5931814,,,IP_2992403,
ISIC_0014807,Anonymous,CC-0,30,,,,,,,,IL_7892964,,,IP_4678429,
ISIC_0014814,Anonymous,CC-0,50,,,,,,,,IL_7416071,,,IP_1994136,
ISIC_0014815,Anonymous,CC-0,,,,,,,,,IL_5692871,,,IP_9977410,
ISIC_0014820,Anonymous,CC-0,70,,,,,,,,IL_7602542,,,IP_4323307,
ISIC_0014822,Anonymous,CC-0,30,,,,,,,,IL_6039768,,,IP_7795503,
ISIC_0014826,Anonymous,CC-0,45,,,,,,,,IL_3573306,,,IP_7383530,
ISIC_0014833,Anonymous,CC-0,20,,,,,,,,IL_6301291,,,IP_8840216,
ISIC_0014835,Anonymous,CC-0,45,,,,,,,,IL_4021235,,,IP_5320566,
ISIC_0014844,Anonymous,CC-0,,,,,,,,,IL_8561856,,,IP_5495912,
ISIC_0014853,Anonymous,CC-0,60,,,,,,,,IL_3602382,,,IP_2214242,
ISIC_0014854,Anonymous,CC-0,35,,,,,,,,IL_2401888,,,IP_3518981,
ISIC_0014862,Anonymous,CC-0,25,,,,,,,,IL_2957955,,,IP_2757871,
ISIC_0014863,Anonymous,CC-0,25,,,,,,,,IL_8283118,,,IP_3011385,
ISIC_0014867,Anonymous,CC-0,45,,,,,,,,IL_3336111,,,IP_6442028,
ISIC_0014868,Anonymous,CC-0,,,,,,,,,IL_5335294,,,IP_6914867,
ISIC_0014872,Anonymous,CC-0,50,,,,,,,,IL_7449056,,,IP_2912920,
ISIC_0014876,Anonymous,CC-0,45,,,,,,,,IL_1178442,,,IP_5639393,
ISIC_0014879,Anonymous,CC-0,35,,,,,,,,IL_3755225,,,IP_2942145,
ISIC_0014883,Anonymous,CC-0,,,,,,,,,IL_1974890,,,IP_9905504,
ISIC_0014901,Anonymous,CC-0,,,,,,,,,IL_8218158,,,IP_4875821,
ISIC_0014907,Anonymous,CC-0,35,,,,,,,,IL_6706989,,,IP_6848507,
ISIC_0014910,Anonymous,CC-0,30,,,,,,,,IL_3363888,,,IP_8435831,
ISIC_0014912,Anonymous,CC-0,,,,,,,,,IL_5095111,,,IP_5371015,
ISIC_0014921,Anonymous,CC-0,30,,,,,,,,IL_7423663,,,IP_7795503,
ISIC_0014927,Anonymous,CC-0,25,,,,,,,,IL_5900280,,,IP_9171674,
ISIC_0014928,Anonymous,CC-0,30,,,,,,,,IL_1617566,,,IP_2473924,
ISIC_0014932,Anonymous,CC-0,,,,,,,,,IL_6475200,,,IP_9724716,
ISIC_0014936,Anonymous,CC-0,45,,,,,,,,IL_1132140,,,IP_2442737,
ISIC_0014938,Anonymous,CC-0,40,,,,,,,,IL_7516792,,,IP_9317647,
ISIC_0014940,Anonymous,CC-0,35,,,,,,,,IL_5322390,,,IP_8915265,
ISIC_0014941,Anonymous,CC-0,20,,,,,,,,IL_1367590,,,IP_6997258,
ISIC_0014942,Anonymous,CC-0,45,,,,,,,,IL_4660080,,,IP_0072197,
ISIC_0014943,Anonymous,CC-0,45,,,,,,,,IL_0858214,,,IP_4021997,
ISIC_0014944,Anonymous,CC-0,55,,,,,,,,IL_4221138,,,IP_3229302,
ISIC_0014947,Anonymous,CC-0,15,,,,,,,,IL_6922908,,,IP_8442841,
ISIC_0014948,Anonymous,CC-0,50,,,,,,,,IL_8277002,,,IP_0549781,
ISIC_0014949,Anonymous,CC-0,75,,,,,,,,IL_8656691,,,IP_4497472,
ISIC_0014952,Anonymous,CC-0,55,,,,,,,,IL_3740061,,,IP_2432412,
ISIC_0014955,Anonymous,CC-0,60,,,,,,,,IL_1520628,,,IP_9776663,
ISIC_0014956,Anonymous,CC-0,35,,,,,,,,IL_7403331,,,IP_6510212,
ISIC_0014957,Anonymous,CC-0,15,,,,,,,,IL_1542751,,,IP_0398447,
ISIC_0014958,Anonymous,CC-0,85,,,,,,,,IL_5977277,,,IP_6916514,
ISIC_0014959,Anonymous,CC-0,25,,,,,,,,IL_1861474,,,IP_1575036,
ISIC_0014961,Anonymous,CC-0,30,,,,,,,,IL_0019781,,,IP_9164956,
ISIC_0014962,Anonymous,CC-0,35,,,,,,,,IL_8096833,,,IP_3004141,
ISIC_0014963,Anonymous,CC-0,60,,,,,,,,IL_3588696,,,IP_2040914,
ISIC_0014964,Anonymous,CC-0,30,,,,,,,,IL_0159729,,,IP_1132421,
ISIC_0014966,Anonymous,CC-0,50,,,,,,,,IL_3560143,,,IP_1204192,
ISIC_0014968,Anonymous,CC-0,,,,,,,,,IL_3360257,,,IP_6727905,
ISIC_0014969,Anonymous,CC-0,40,,,,,,,,IL_0336950,,,IP_3437766,
ISIC_0014973,Anonymous,CC-0,,,,,,,,,IL_1705341,,,IP_8384409,
ISIC_0014974,Anonymous,CC-0,50,,,,,,,,IL_4141126,,,IP_2699662,
ISIC_0014977,Anonymous,CC-0,,,,,,,,,IL_6599597,,,IP_0385131,
ISIC_0014982,Anonymous,CC-0,,,,,,,,,IL_0639740,,,IP_0737699,
ISIC_0014992,Anonymous,CC-0,25,,,,,,,,IL_2605919,,,IP_1575036,
ISIC_0014994,Anonymous,CC-0,50,,,,,,,,IL_8980828,,,IP_8419708,
ISIC_0014998,Anonymous,CC-0,,,,,,,,,IL_0084386,,,IP_8237521,
ISIC_0015002,Anonymous,CC-0,25,,,,,,,,IL_1575619,,,IP_0164065,
ISIC_0015003,Anonymous,CC-0,40,,,,,,,,IL_3219751,,,IP_7884699,
ISIC_0015004,Anonymous,CC-0,65,,,,,,,,IL_1317556,,,IP_9318818,
ISIC_0015007,Anonymous,CC-0,15,,,,,,,,IL_3741024,,,IP_0532448,
ISIC_0015008,Anonymous,CC-0,,,,,,,,,IL_4587974,,,IP_5692649,
ISIC_0015009,Anonymous,CC-0,15,,,,,,,,IL_3235123,,,IP_2636565,
ISIC_0015011,Anonymous,CC-0,25,,,,,,,,IL_4622319,,,IP_2943735,
ISIC_0015013,Anonymous,CC-0,30,,,,,,,,IL_9737055,,,IP_7936899,
ISIC_0015015,Anonymous,CC-0,,,,,,,,,IL_0685275,,,IP_1063136,
ISIC_0015016,Anonymous,CC-0,25,,,,,,,,IL_0998820,,,IP_4145083,
ISIC_0015018,Anonymous,CC-0,,,,,,,,,IL_0312324,,,IP_0688856,
ISIC_0015019,Anonymous,CC-0,35,,,,,,,,IL_0540776,,,IP_7795503,
ISIC_0015020,Anonymous,CC-0,,,,,,,,,IL_8740570,,,IP_9374761,
ISIC_0015021,Anonymous,CC-0,20,,,,,,,,IL_1703339,,,IP_8670872,
ISIC_0015023,Anonymous,CC-0,25,,,,,,,,IL_2210435,,,IP_9025345,
ISIC_0015026,Anonymous,CC-0,70,,,,,,,,IL_7081941,,,IP_2319554,
ISIC_0015030,Anonymous,CC-0,20,,,,,,,,IL_5093196,,,IP_4807415,
ISIC_0015031,Anonymous,CC-0,20,,,,,,,,IL_9753559,,,IP_6616274,
ISIC_0015034,Anonymous,CC-0,50,,,,,,,,IL_6803681,,,IP_5864823,
ISIC_0015035,Anonymous,CC-0,40,,,,,,,,IL_1153922,,,IP_4013234,
ISIC_0015037,Anonymous,CC-0,25,,,,,,,,IL_2452627,,,IP_3223522,
ISIC_0015040,Anonymous,CC-0,50,,,,,,,,IL_4430788,,,IP_2424644,
ISIC_0015041,Anonymous,CC-0,50,,,,,,,,IL_0694421,,,IP_2424644,
ISIC_0015046,Anonymous,CC-0,,,,,,,,,IL_8934451,,,IP_7278034,
ISIC_0015050,Anonymous,CC-0,50,,,,,,,,IL_4369322,,,IP_5703644,
ISIC_0015051,Anonymous,CC-0,65,,,,,,,,IL_4205791,,,IP_6465250,
ISIC_0015056,Anonymous,CC-0,85,,,,,,,,IL_0992633,,,IP_6727616,
ISIC_0015057,Anonymous,CC-0,30,,,,,,,,IL_0910467,,,IP_5515826,
ISIC_0015060,Anonymous,CC-0,50,,,,,,,,IL_4520749,,,IP_8071364,
ISIC_0015064,Anonymous,CC-0,50,,,,,,,,IL_4008184,,,IP_1044571,
ISIC_0015071,Anonymous,CC-0,35,,,,,,,,IL_9981630,,,IP_2459883,
ISIC_0015078,Anonymous,CC-0,,,,,,,,,IL_8825244,,,IP_6464727,
ISIC_0015089,Anonymous,CC-0,65,,,,,,,,IL_1719782,,,IP_8228246,
ISIC_0015102,Anonymous,CC-0,45,,,,,,,,IL_9632690,,,IP_2673128,
ISIC_0015115,Anonymous,CC-0,60,,,,,,,,IL_2632548,,,IP_4569374,
ISIC_0015118,Anonymous,CC-0,65,,,,,,,,IL_6346578,,,IP_2169026,
ISIC_0015119,Anonymous,CC-0,55,,,,,,,,IL_8399716,,,IP_8599593,
ISIC_0015125,Anonymous,CC-0,35,,,,,,,,IL_6857050,,,IP_6844433,
ISIC_0015127,Anonymous,CC-0,,,,,,,,,IL_7953100,,,IP_4639947,
ISIC_0015129,Anonymous,CC-0,,,,,,,,,IL_3365674,,,IP_2473989,
ISIC_0015130,Anonymous,CC-0,,,,,,,,,IL_7081892,,,IP_7029073,
ISIC_0015132,Anonymous,CC-0,75,,,,,,,,IL_2843794,,,IP_0834679,
ISIC_0015133,Anonymous,CC-0,,,,,,,,,IL_0509451,,,IP_1241470,
ISIC_0015136,Anonymous,CC-0,65,,,,,,,,IL_4198412,,,IP_6916514,
ISIC_0015139,Anonymous,CC-0,30,,,,,,,,IL_4844572,,,IP_4430465,
ISIC_0015140,Anonymous,CC-0,25,,,,,,,,IL_6728561,,,IP_0913529,
ISIC_0015142,Anonymous,CC-0,,,,,,,,,IL_5959802,,,IP_2939933,
ISIC_0015146,Anonymous,CC-0,,,,,,,,,IL_5360151,,,IP_1584328,
ISIC_0015149,Anonymous,CC-0,85,,,,,,,,IL_2965880,,,IP_2076749,
ISIC_0015150,Anonymous,CC-0,35,,,,,,,,IL_3738336,,,IP_5031651,
ISIC_0015152,Anonymous,CC-0,50,,,,,,,,IL_4727068,,,IP_8401841,
ISIC_0015155,Anonymous,CC-0,30,,,,,,,,IL_0174747,,,IP_2727075,
ISIC_0015156,Anonymous,CC-0,65,,,,,,,,IL_3636597,,,IP_0858413,
ISIC_0015157,Anonymous,CC-0,50,,,,,,,,IL_1124427,,,IP_0074642,
ISIC_0015160,Anonymous,CC-0,30,,,,,,,,IL_9744886,,,IP_1548908,
ISIC_0015161,Anonymous,CC-0,30,,,,,,,,IL_4179725,,,IP_1490056,
ISIC_0015163,Anonymous,CC-0,75,,,,,,,,IL_6985239,,,IP_2172670,
ISIC_0015167,Anonymous,CC-0,,,,,,,,,IL_8599278,,,IP_0478912,
ISIC_0015171,Anonymous,CC-0,,,,,,,,,IL_4377550,,,IP_5007260,
ISIC_0015173,Anonymous,CC-0,50,,,,,,,,IL_1213726,,,IP_2673128,
ISIC_0015174,Anonymous,CC-0,50,,,,,,,,IL_1956212,,,IP_2673128,
ISIC_0015175,Anonymous,CC-0,30,,,,,,,,IL_1923150,,,IP_7841691,
ISIC_0015176,Anonymous,CC-0,25,,,,,,,,IL_6907695,,,IP_7182272,
ISIC_0015179,Anonymous,CC-0,65,,,,,,,,IL_7758782,,,IP_6451919,
ISIC_0015180,Anonymous,CC-0,65,,,,,,,,IL_7692217,,,IP_5269367,
ISIC_0015184,Anonymous,CC-0,30,,,,,,,,IL_0037541,,,IP_0907286,
ISIC_0015185,Anonymous,CC-0,70,,,,,,,,IL_0909313,,,IP_3649272,
ISIC_0015193,Anonymous,CC-0,,,,,,,,,IL_8422912,,,IP_3248599,
ISIC_0015201,Anonymous,CC-0,35,,,,,,,,IL_2936677,,,IP_2167611,
ISIC_0015202,Anonymous,CC-0,,,,,,,,,IL_4283852,,,IP_3583935,
ISIC_0015203,Anonymous,CC-0,,,,,,,,,IL_1435618,,,IP_0228187,
ISIC_0015206,Anonymous,CC-0,40,,,,,,,,IL_8437022,,,IP_8676448,
ISIC_0015207,Anonymous,CC-0,45,,,,,,,,IL_3373836,,,IP_0850559,
ISIC_0015208,Anonymous,CC-0,45,,,,,,,,IL_4790981,,,IP_7354501,
ISIC_0015212,Anonymous,CC-0,30,,,,,,,,IL_8334568,,,IP_2821769,
ISIC_0015215,Anonymous,CC-0,45,,,,,,,,IL_7837048,,,IP_1608806,
ISIC_0015216,Anonymous,CC-0,65,,,,,,,,IL_3661456,,,IP_6867869,
ISIC_0015217,Anonymous,CC-0,25,,,,,,,,IL_0898751,,,IP_0913529,
ISIC_0015218,Anonymous,CC-0,25,,,,,,,,IL_1798585,,,IP_1087114,
ISIC_0015223,Anonymous,CC-0,30,,,,,,,,IL_8450961,,,IP_3698059,
ISIC_0015224,Anonymous,CC-0,50,,,,,,,,IL_1687312,,,IP_4239784,
ISIC_0015226,Anonymous,CC-0,,,,,,,,,IL_6479246,,,IP_4232303,
ISIC_0015229,Anonymous,CC-0,75,,,,,,,,IL_5176085,,,IP_4497472,
ISIC_0015232,Anonymous,CC-0,40,,,,,,,,IL_8406199,,,IP_7467442,
ISIC_0015237,Anonymous,CC-0,,,,,,,,,IL_9948787,,,IP_5857506,
ISIC_0015241,Anonymous,CC-0,60,,,,,,,,IL_4349522,,,IP_8793923,
ISIC_0015244,Anonymous,CC-0,50,,,,,,,,IL_4529955,,,IP_9543100,
ISIC_0015245,Anonymous,CC-0,65,,,,,,,,IL_1145778,,,IP_8621495,
ISIC_0015250,Anonymous,CC-0,40,,,,,,,,IL_2009696,,,IP_2464739,
ISIC_0015251,Anonymous,CC-0,45,,,,,,,,IL_1294135,,,IP_5021829,
ISIC_0015254,Anonymous,CC-0,50,,,,,,,,IL_5542065,,,IP_2912920,
ISIC_0015255,Anonymous,CC-0,50,,,,,,,,IL_4917546,,,IP_2673128,
ISIC_0015258,Anonymous,CC-0,40,,,,,,,,IL_4936250,,,IP_1150846,
ISIC_0015264,Anonymous,CC-0,25,,,,,,,,IL_9713041,,,IP_8178852,
ISIC_0015270,Anonymous,CC-0,60,,,,,,,,IL_0218335,,,IP_7188547,
ISIC_0015273,Anonymous,CC-0,35,,,,,,,,IL_2350047,,,IP_2751563,
ISIC_0015274,Anonymous,CC-0,40,,,,,,,,IL_8745788,,,IP_5886200,
ISIC_0015276,Anonymous,CC-0,60,,,,,,,,IL_8063828,,,IP_1461785,
ISIC_0015279,Anonymous,CC-0,,,,,,,,,IL_7057585,,,IP_9267544,
ISIC_0015283,Anonymous,CC-0,20,,,,,,,,IL_1455619,,,IP_6645311,
ISIC_0015291,Anonymous,CC-0,35,,,,,,,,IL_8852371,,,IP_0630443,
ISIC_0015293,Anonymous,CC-0,45,,,,,,,,IL_4050605,,,IP_3602221,
ISIC_0015298,Anonymous,CC-0,45,,,,,,,,IL_5898494,,,IP_3038240,
ISIC_0015309,Anonymous,CC-0,25,,,,,,,,IL_6907956,,,IP_1223349,
ISIC_0015310,Anonymous,CC-0,30,,,,,,,,IL_0580957,,,IP_3506886,
ISIC_0015311,Anonymous,CC-0,35,,,,,,,,IL_6050130,,,IP_6771252,