isic_id,attribution,copyright_license,age_approx,anatom_site_general,benign_malignant,concomitant_biopsy,diagnosis,diagnosis_confirm_type,image_type,mel_class,mel_thick_mm,sex
ISIC_0218248,Memorial Sloan Kettering Cancer Center,CC-0,75,upper extremity,malignant,True,melanoma,histopathology,clinical: overview,invasive melanoma,1.70,female
ISIC_0925734,Memorial Sloan Kettering Cancer Center,CC-0,85,palms/soles,benign,False,nevus,single image expert consensus,clinical: overview,,,female
ISIC_0925996,Memorial Sloan Kettering Cancer Center,CC-0,40,posterior torso,benign,True,nevus,histopathology,clinical: overview,,,male
ISIC_1157493,Memorial Sloan Kettering Cancer Center,CC-0,45,lateral torso,benign,True,nevus,histopathology,clinical: overview,,,female
ISIC_1431322,Memorial Sloan Kettering Cancer Center,CC-0,35,posterior torso,benign,True,nevus,histopathology,clinical: overview,,,female
ISIC_1488253,Memorial Sloan Kettering Cancer Center,CC-0,55,upper extremity,benign,False,nevus,single image expert consensus,clinical: overview,,,male
ISIC_2102830,Memorial Sloan Kettering Cancer Center,CC-0,60,upper extremity,malignant,True,melanoma,histopathology,clinical: overview,invasive melanoma,0.65,female
ISIC_2167440,Memorial Sloan Kettering Cancer Center,CC-0,65,upper extremity,malignant,True,melanoma,histopathology,clinical: overview,invasive melanoma,,male
ISIC_2560600,Memorial Sloan Kettering Cancer Center,CC-0,80,head/neck,malignant,True,melanoma,histopathology,clinical: overview,invasive melanoma,1.00,female
ISIC_3000292,Memorial Sloan Kettering Cancer Center,CC-0,55,lower extremity,malignant,True,melanoma,histopathology,clinical: overview,invasive melanoma,0.40,female
ISIC_3000299,Memorial Sloan Kettering Cancer Center,CC-0,50,upper extremity,benign,False,nevus,single image expert consensus,clinical: overview,,,female
ISIC_4382761,Memorial Sloan Kettering Cancer Center,CC-0,60,head/neck,malignant,True,melanoma,histopathology,clinical: overview,invasive melanoma,0.20,male
ISIC_4761058,Memorial Sloan Kettering Cancer Center,CC-0,70,lower extremity,malignant,True,melanoma,histopathology,clinical: overview,invasive melanoma,0.80,female
ISIC_5083884,Memorial Sloan Kettering Cancer Center,CC-0,25,head/neck,benign,True,nevus,histopathology,clinical: overview,,,female
ISIC_5219984,Memorial Sloan Kettering Cancer Center,CC-0,30,upper extremity,benign,True,nevus,histopathology,clinical: overview,,,female
ISIC_5435484,Memorial Sloan Kettering Cancer Center,CC-0,35,anterior torso,benign,True,nevus,histopathology,clinical: overview,,,female
ISIC_5877136,Memorial Sloan Kettering Cancer Center,CC-0,50,posterior torso,benign,True,nevus,histopathology,clinical: overview,,,male
ISIC_5879786,Memorial Sloan Kettering Cancer Center,CC-0,30,anterior torso,benign,True,nevus,histopathology,clinical: overview,,,female
ISIC_5935679,Memorial Sloan Kettering Cancer Center,CC-0,65,upper extremity,malignant,True,melanoma,histopathology,clinical: overview,invasive melanoma,0.20,male
ISIC_6251739,Memorial Sloan Kettering Cancer Center,CC-0,40,anterior torso,benign,True,nevus,histopathology,clinical: overview,,,female
ISIC_6574040,Memorial Sloan Kettering Cancer Center,CC-0,40,posterior torso,benign,False,nevus,single image expert consensus,clinical: overview,,,female
ISIC_6605399,Memorial Sloan Kettering Cancer Center,CC-0,25,upper extremity,benign,True,nevus,histopathology,clinical: overview,,,male
ISIC_6696802,Memorial Sloan Kettering Cancer Center,CC-0,55,posterior torso,benign,True,nevus,histopathology,clinical: overview,,,female
ISIC_6746681,Memorial Sloan Kettering Cancer Center,CC-0,75,lower extremity,benign,False,nevus,single image expert consensus,clinical: overview,,,female
ISIC_6894371,Memorial Sloan Kettering Cancer Center,CC-0,60,anterior torso,malignant,True,melanoma,histopathology,clinical: overview,invasive melanoma,0.50,male
ISIC_6899527,Memorial Sloan Kettering Cancer Center,CC-0,80,upper extremity,malignant,True,melanoma,histopathology,clinical: overview,invasive melanoma,0.30,male
ISIC_8171432,Memorial Sloan Kettering Cancer Center,CC-0,65,upper extremity,malignant,True,melanoma,histopathology,clinical: overview,invasive melanoma,0.80,female
ISIC_8590029,Memorial Sloan Kettering Cancer Center,CC-0,25,posterior torso,benign,True,nevus,histopathology,clinical: overview,,,female
ISIC_8968467,Memorial Sloan Kettering Cancer Center,CC-0,40,posterior torso,benign,True,nevus,histopathology,clinical: overview,,,male
ISIC_9260532,Memorial Sloan Kettering Cancer Center,CC-0,85,anterior torso,malignant,True,melanoma,histopathology,clinical: overview,invasive melanoma,0.80,male
ISIC_9389491,Memorial Sloan Kettering Cancer Center,CC-0,30,anterior torso,benign,True,nevus,histopathology,clinical: overview,,,female
ISIC_9591897,Memorial Sloan Kettering Cancer Center,CC-0,85,anterior torso,malignant,True,melanoma,histopathology,clinical: overview,invasive melanoma,1.40,male
ISIC_9612785,Memorial Sloan Kettering Cancer Center,CC-0,50,anterior torso,benign,True,nevus,histopathology,clinical: overview,,,male
ISIC_9622866,Memorial Sloan Kettering Cancer Center,CC-0,80,upper extremity,malignant,True,melanoma,histopathology,clinical: overview,invasive melanoma,0.10,female
ISIC_9913448,Memorial Sloan Kettering Cancer Center,CC-0,65,upper extremity,malignant,True,melanoma,histopathology,clinical: overview,invasive melanoma,1.00,male
